{"text_format":"1","workbook":"xlsx","n_sheets":6,"sheets":["Web Prepop","PrePop","52723","Reference","Blank","BOM_EOM"],"not_rendered":{"charts":0,"images":14,"macros":1,"external_links":0,"defined_names":99,"comments":1,"pivot_tables":0},"unopened":[],"bounds":{"document_bytes":16777216,"sheet_cells":100000,"rows_first":2000,"rows_last":500,"rows_between":2000,"halvings":0,"cell_chars":16384,"cell_head_chars":4096},"cells_cut":0,"cells_raw":0,"read":"whole","date_system":"1900"}

{"sheet":"Web Prepop","index":0,"n_rows":16,"n_cols":168,"rows_kept":16,"cut":false,"hidden":true,"merged":[]}
["PHA Code","PHA Name","PPN","Address","City_Zip","Funding_Period","Sub_Type","ACC","HA_FY","DUNS","ROFO","FA_Name","Filing_Date","FO_Code","Region_Code","Phone","Email","H_Units","H_Unit_+","H_Unit_-","H_Unit_total","H_ColA1","H_ColA2","H_ColA3","H_ColA4","H_ColA5","H_ColA6","H_ColA7","H_ColA8","H_ColA9","H_ColA10","H_ColA11","H_ColA12","H_ColA13","H_ColA15","H_ColB1","H_ColB3","H_ColB4","H_ColB5","H_ColB6","H_ColB6a","H_ColB7","H_ColB8","H_ColB9","H_ColB10","H_ColB14","H_ColB15","H_ColB17","H_ColC1","H_ColC2","H_ColC3","H_ColC4","H_ColC15","H_ColC16","H_A1","H_A2","H_A3","H_A4","H_A5","H_A6","H_A7","H_A8","H_A9","H_A10","H_A11","H_A12","H_A13","H_A14","H_A15","H_A16","H_A17","H_B1","H_B2","H_B3","H_B4","H_C1","H_C2","H_C3","H_C4","H_D1","H_D2","H_D3","H_E1","H_E2","H_E3","H_E4","P_Unit","P_Unit_+","P_Unit_-","P_Unit_total","P_ColA1","P_ColA2","P_ColA3","P_ColA4","P_ColA5","P_ColA6","P_ColA7","P_ColA8","P_ColA9","P_ColA10","P_ColA11","P_ColA12","P_ColA13","P_ColA15","P_ColB1","P_ColB3","P_ColB4","P_ColB5","P_ColB6","P_ColB6a","P_ColB7","P_ColB8","P_ColB9","P_ColB10","P_ColB14","P_ColB15","P_ColB17","P_ColC1","P_ColC2","P_ColC3","P_ColC4","P_ColC15","P_ColC16","P_A1","P_A2","P_A3","P_A4","P_A5","P_A6","P_A7","P_A8","P_A9","P_A10","P_A11","P_A12","P_A13","P_A14","P_A15","P_A16","P_A17","P_B1","P_B2","P_B3","P_B4","P_C1","P_C2","P_C3","P_C4","P_D1","P_D2","P_D3","A_M_Fee","CFR215","CFR190","USC","FYE","PHAUNITS","C2Fact","HUDUNITS","PUMUEL","PUMFFI","CFR990","BOM","H_A7","ResidentUtilities","Comments","PILOT","AUDIT"]
["CT007","Housing Authority of the City of Stamford","CT007000009","22 Clinton Avenue","Stamford, CT 06901","01/01/2015 to 12/31/2015","Orig","NY-378","2014-06-30","086642915","0126","Kathleen Bowen",null,"1EPH / HARTFORD PROGRAM CENTER","01 / NEW ENGLAND",null,"kathleen.m.bowen@hud.gov",null,null,null,null,null,null,null,null,null,null,null,null,null,null,null,null,null,null,null,null,null,null,null,null,null,null,null,null,null,null,null,null,null,null,null,null,null,null,null,null,null,null,null,null,null,null,null,null,null,null,null,null,null,null,null,null,null,null,null,null,null,null,null,null,null,null,null,null,null,null,null,null,null,null,null,null,null,null,null,null,null,null,null,null,null,null,null,null,null,null,null,null,null,null,null,null,null,null,null,null,null,null,null,null,null,null,403.89,1.0189999999999999,411.56,null,null,null,null,null,null,null,null,null,null,null,null,null,null,null,null,null,null,null,null,null,null,null,null,null,true,true,false,null,null,502,0,502,null,null,true]
["FL005","MIAMI DADE PUBLIC HOUSING AND COMMUNITY DEV","FL005000853","701 NW 1st Court","Miami, FL 33136","01/01/2015 to 12/31/2015","Orig","A-4252","2014-09-30","136721177","0414","Michael J. Carney",null,"4DPH / MIAMI HUB OFFICE","04 / SOUTHEAST/CARIBBEAN",null,"michael.j.carney@hud.gov",null,null,null,null,null,null,null,null,null,null,null,null,null,null,null,null,null,null,null,null,null,null,null,null,null,null,null,null,null,null,null,null,null,null,null,null,null,null,null,null,null,null,null,null,null,null,null,null,null,null,null,null,null,null,null,null,null,null,null,null,null,null,null,null,null,null,null,null,null,null,null,null,null,null,null,null,null,null,null,null,null,null,null,null,null,null,null,null,null,null,null,null,null,null,null,null,null,null,null,null,null,null,null,null,null,null,487.46,1.006,490.38,null,null,null,null,null,null,null,null,null,null,null,null,null,null,null,null,null,null,null,null,null,null,null,null,null,true,true,false,null,null,8230,0,9408,null,null,true]
["FL005","MIAMI DADE PUBLIC HOUSING AND COMMUNITY DEV","FL005000854","701 NW 1st Court","Miami, FL 33136","01/01/2015 to 12/31/2015","Orig","A-4252","2014-09-30","136721177","0414","Michael J. Carney",null,"4DPH / MIAMI HUB OFFICE","04 / SOUTHEAST/CARIBBEAN",null,"michael.j.carney@hud.gov",null,null,null,null,null,null,null,null,null,null,null,null,null,null,null,null,null,null,null,null,null,null,null,null,null,null,null,null,null,null,null,null,null,null,null,null,null,null,null,null,null,null,null,null,null,null,null,null,null,null,null,null,null,null,null,null,null,null,null,null,null,null,null,null,null,null,null,null,null,null,null,null,null,null,null,null,null,null,null,null,null,null,null,null,null,null,null,null,null,null,null,null,null,null,null,null,null,null,null,null,null,null,null,null,null,null,355.73,1.006,357.86,null,null,null,null,null,null,null,null,null,null,null,null,null,null,null,null,null,null,null,null,null,null,null,null,null,true,true,false,null,null,8230,0,9408,null,null,true]
["FL009","WEST PALM BEACH HOUSING AUTHORITY","FL009000056","1715 Division Avenue","West Palm Beach, FL 33407","01/01/2015 to 12/31/2015","Orig","A-3625","2013-03-31","177614559","0414","Bibi A. Lachman",null,"4DPH / MIAMI HUB OFFICE","04 / SOUTHEAST/CARIBBEAN",null,"Bibi.A.Lachman@hud.gov",null,null,null,null,null,null,null,null,null,null,null,null,null,null,null,null,null,null,null,null,null,null,null,null,null,null,null,null,null,null,null,null,null,null,null,null,null,null,null,null,null,null,null,null,null,null,null,null,null,null,null,null,null,null,null,null,null,null,null,null,null,null,null,null,null,null,null,null,null,null,null,null,null,null,null,null,null,null,null,null,null,null,null,null,null,null,null,null,null,null,null,null,null,null,null,null,null,null,null,null,null,null,null,null,null,null,423,1.006,425.54,null,null,null,null,null,null,null,null,null,null,null,null,null,null,null,null,null,null,null,null,null,null,null,null,null,true,true,true,null,null,584,0,302,null,null,true]
["FL075","CLEARWATER HOUSING AUTHORITY","FL075000007","908 Cleveland Street","Clearwater, FL 33755","01/01/2015 to 12/31/2015","Orig","A-4125","2013-03-31","010511764","0414","Michael J. Carney",null,"4DPH / MIAMI HUB OFFICE","04 / SOUTHEAST/CARIBBEAN",null,"michael.j.carney@hud.gov",null,null,null,null,null,null,null,null,null,null,null,null,null,null,null,null,null,null,null,null,null,null,null,null,null,null,null,null,null,null,null,null,null,null,null,null,null,null,null,null,null,null,null,null,null,null,null,null,null,null,null,null,null,null,null,null,null,null,null,null,null,null,null,null,null,null,null,null,null,null,null,null,null,null,null,null,null,null,null,null,null,null,null,null,null,null,null,null,null,null,null,null,null,null,null,null,null,null,null,null,null,null,null,null,null,null,334.5,1.006,336.51,null,null,null,null,null,null,null,null,null,null,null,null,null,null,null,null,null,null,null,null,null,null,null,null,null,false,true,false,null,null,205,0,205,null,null,false]
["GA003","Housing Authority of the City of Athens","GA003000015","PO Box 1469","Athens, GA 30603","01/01/2015 to 12/31/2015","Orig","A-3702","2013-06-30","072486046","0401","Jorge L. Torres",null,"4APH / ATLANTA HUB OFFICE","04 / SOUTHEAST/CARIBBEAN",null,"jorge.l.torres@hud.gov",null,null,null,null,null,null,null,null,null,null,null,null,null,null,null,null,null,null,null,null,null,null,null,null,null,null,null,null,null,null,null,null,null,null,null,null,null,null,null,null,null,null,null,null,null,null,null,null,null,null,null,null,null,null,null,null,null,null,null,null,null,null,null,null,null,null,null,null,null,null,null,null,null,null,null,null,null,null,null,null,null,null,null,null,null,null,null,null,null,null,null,null,null,null,null,null,null,null,null,null,null,null,null,null,null,null,280.76,1.01,283.57,null,null,null,null,null,null,null,null,null,null,null,null,null,null,null,null,null,null,null,null,null,null,null,null,null,true,true,false,null,null,1134,0,1134,null,null,true]
["NC001","Housing Authority of the City of Wilmington","NC001000021","PO Box 899","Wilmington, NC 28402","01/01/2015 to 12/31/2015","Orig","A-4312","2013-03-31","177064342","0419","Freda J. Talley",null,"4FPH / GREENSBORO HUB OFFICE","04 / SOUTHEAST/CARIBBEAN",null,"Freda.J.Talley@hud.gov",null,null,null,null,null,null,null,null,null,null,null,null,null,null,null,null,null,null,null,null,null,null,null,null,null,null,null,null,null,null,null,null,null,null,null,null,null,null,null,null,null,null,null,null,null,null,null,null,null,null,null,null,null,null,null,null,null,null,null,null,null,null,null,null,null,null,null,null,null,null,null,null,null,null,null,null,null,null,null,null,null,null,null,null,null,null,null,null,null,null,null,null,null,null,null,null,null,null,null,null,null,null,null,null,null,null,458.68,1.016,466.02,null,null,null,null,null,null,null,null,null,null,null,null,null,null,null,null,null,null,null,null,null,null,null,null,null,true,true,false,null,null,1060,0,1060,null,null,true]
["NC004","Housing Authority of the City of Kinston","NC004000009","PO Box 697","Kinston, NC 28502","01/01/2015 to 12/31/2015","Orig","A-4311","2013-12-31","001967579","0419","Freda J. Talley",null,"4FPH / GREENSBORO HUB OFFICE","04 / SOUTHEAST/CARIBBEAN",null,"Freda.J.Talley@hud.gov",null,null,null,null,null,null,null,null,null,null,null,null,null,null,null,null,null,null,null,null,null,null,null,null,null,null,null,null,null,null,null,null,null,null,null,null,null,null,null,null,null,null,null,null,null,null,null,null,null,null,null,null,null,null,null,null,null,null,null,null,null,null,null,null,null,null,null,null,null,null,null,null,null,null,null,null,null,null,null,null,null,null,null,null,null,null,null,null,null,null,null,null,null,null,null,null,null,null,null,null,null,null,null,null,null,null,376.1,1.01,379.86,null,null,null,null,null,null,null,null,null,null,null,null,null,null,null,null,null,null,null,null,null,null,null,null,null,true,true,false,null,null,711,0,711,null,null,true]
["NE003","Hall County Housing Authority","NE003000003","1834 W 7th St","Grand Island, NE 68803","01/01/2015 to 12/31/2015","Orig","C-352","2013-06-30","042361613","0726","Jeanne Coats",null,"7DPH / OMAHA PROGRAM CENTER","07 / GREAT PLAINS",null,"jeanne.m.coats@hud.gov",null,null,null,null,null,null,null,null,null,null,null,null,null,null,null,null,null,null,null,null,null,null,null,null,null,null,null,null,null,null,null,null,null,null,null,null,null,null,null,null,null,null,null,null,null,null,null,null,null,null,null,null,null,null,null,null,null,null,null,null,null,null,null,null,null,null,null,null,null,null,null,null,null,null,null,null,null,null,null,null,null,null,null,null,null,null,null,null,null,null,null,null,null,null,null,null,null,null,null,null,null,null,null,null,null,null,324.43,1.0229999999999999,331.89,null,null,null,null,null,null,null,null,null,null,null,null,null,null,null,null,null,null,null,null,null,null,null,null,null,true,true,true,null,null,391,0,391,null,null,true]
{"$rows_left_out":7}
{"sheet":"PrePop","index":1,"n_rows":1,"n_cols":168,"rows_kept":1,"cut":false,"hidden":true,"merged":[]}
["PHA Code","PHA Name","PPN","Address","City_Zip","Funding_Period","Sub_Type","ACC","HA_FY","DUNS","ROFO","FA_Name","Filing_Date","FO_Code","Region_Code","Phone","Email","H_Units","H_Unit_+","H_Unit_-","H_Unit_total","H_ColA1","H_ColA2","H_ColA3","H_ColA4","H_ColA5","H_ColA6","H_ColA7","H_ColA8","H_ColA9","H_ColA10","H_ColA11","H_ColA12","H_ColA13","H_ColA15","H_ColB1","H_ColB3","H_ColB4","H_ColB5","H_ColB6","H_ColB6a","H_ColB7","H_ColB8","H_ColB9","H_ColB10","H_ColB14","H_ColB15","H_ColB17","H_ColC1","H_ColC2","H_ColC3","H_ColC4","H_ColC15","H_ColC16","H_A1","H_A2","H_A3","H_A4","H_A5","H_A6","H_A7","H_A8","H_A9","H_A10","H_A11","H_A12","H_A13","H_A14","H_A15","H_A16","H_A17","H_B1","H_B2","H_B3","H_B4","H_C1","H_C2","H_C3","H_C4","H_D1","H_D2","H_D3","H_E1","H_E2","H_E3","H_E4","P_Unit","P_Unit_+","P_Unit_-","P_Unit_total","P_ColA1","P_ColA2","P_ColA3","P_ColA4","P_ColA5","P_ColA6","P_ColA7","P_ColA8","P_ColA9","P_ColA10","P_ColA11","P_ColA12","P_ColA13","P_ColA15","P_ColB1","P_ColB3","P_ColB4","P_ColB5","P_ColB6","P_ColB6a","P_ColB7","P_ColB8","P_ColB9","P_ColB10","P_ColB14","P_ColB15","P_ColB17","P_ColC1","P_ColC2","P_ColC3","P_ColC4","P_ColC15","P_ColC16","P_A1","P_A2","P_A3","P_A4","P_A5","P_A6","P_A7","P_A8","P_A9","P_A10","P_A11","P_A12","P_A13","P_A14","P_A15","P_A16","P_A17","P_B1","P_B2","P_B3","P_B4","P_C1","P_C2","P_C3","P_C4","P_D1","P_D2","P_D3","A_M_Fee","CFR215","CFR190","USC","FYE","PHAUNITS","C2Fact","HUDUNITS","PUMUEL","PUMFFI","CFR990","BOM","H_A7","ResidentUtilities","Comments","PILOT","AUDIT"]

{"sheet":"52723","index":2,"n_rows":172,"n_cols":13,"rows_kept":172,"cut":false,"hidden":true,"merged":[[155,1,155,9],[157,1,157,9],[165,1,165,9],[159,1,159,9],[161,1,161,9],[141,1,141,9],[143,1,143,9],[145,1,145,9],[147,1,147,9],[87,1,87,5],[84,1,84,5],[75,8,75,9],[74,6,74,7],[77,6,77,7],[84,6,84,7],[93,1,93,5],[93,8,93,9],[93,6,93,7],[89,8,89,9],[85,8,85,9],[87,8,87,9],[82,6,82,7],[79,6,79,7],[77,8,77,9],[76,6,76,7],[80,8,80,9],[92,6,92,7],[92,8,92,9],[92,1,92,5],[88,6,88,7],[89,1,89,5],[89,6,89,7],[90,6,90,7],[139,0,139,9],[105,0,105,9],[96,6,96,7],[96,1,96,5],[98,8,98,9],[96,8,96,9],[13,0,13,9],[26,0,26,2],[97,1,97,5],[99,6,99,7],[97,8,97,9],[97,6,97,7],[26,6,26,7],[19,1,19,5],[25,0,25,9],[26,8,26,9],[95,0,95,9],[82,1,82,5],[78,8,78,9],[88,4,88,5],[83,8,83,9],[80,1,80,5],[86,0,86,9],[85,1,85,5],[21,1,21,2],[53,1,53,3],[51,8,51,9],[49,1,49,3],[104,8,104,9],[107,0,138,9],[98,1,98,5],[99,1,99,5],[99,8,99,9],[98,6,98,7],[83,6,83,7],[84,8,84,9],[83,1,83,5],[74,1,74,5],[47,4,47,7],[72,6,72,7],[94,6,94,7],[94,1,94,5],[94,8,94,9],[85,6,85,7],[76,1,76,5],[72,1,72,5],[79,1,79,5],[77,1,77,5],[29,1,31,3],[29,0,31,0],[55,0,55,9],[73,8,73,9],[64,6,64,7],[67,8,67,9],[65,6,65,7],[67,1,67,5],[70,6,70,7],[58,1,59,5],[65,1,65,5],[64,1,64,5],[62,1,62,5],[56,1,56,3],[68,1,68,5],[65,8,65,9],[62,8,62,9],[73,1,73,5],[43,1,43,3],[44,1,44,3],[72,8,72,9],[57,0,57,9],[62,6,62,7],[15,0,15,9],[47,8,47,9],[51,0,51,3],[35,1,35,3],[39,1,39,3],[45,1,45,3],[46,1,46,3],[47,0,47,3],[28,8,28,9],[33,0,33,3],[32,0,32,3],[34,1,34,3],[22,3,22,9],[23,4,23,5],[26,4,26,5],[28,0,28,2],[27,8,27,9],[27,6,27,7],[23,1,23,2],[27,4,27,5],[29,8,29,9],[24,0,24,9],[21,7,21,8],[27,0,27,2],[6,0,6,9],[54,1,54,3],[50,8,50,9],[48,1,48,3],[30,4,30,5],[30,8,30,9],[18,1,18,5],[11,0,11,9],[17,1,17,5],[12,0,12,9],[28,4,28,5],[41,1,41,3],[37,1,37,3],[38,0,38,9],[30,6,30,7],[42,1,42,3],[36,1,36,3],[29,6,29,7],[28,6,28,7],[52,1,52,3],[14,5,14,8],[29,4,29,5],[40,1,40,3],[16,8,16,9],[82,8,82,9],[80,6,80,7],[75,6,75,7],[63,8,63,9],[63,6,63,7],[64,8,64,9],[70,8,70,9],[67,6,67,7],[66,0,66,9],[63,1,63,5],[68,8,68,9],[68,6,68,7],[0,7,0,9],[1,7,1,9],[91,0,91,9],[71,8,71,9],[71,6,71,7],[71,1,71,5],[78,1,78,5],[73,6,73,7],[76,8,76,9],[74,8,74,9],[58,0,59,0],[60,0,60,9],[58,8,59,9],[61,0,61,9],[58,6,59,7],[90,1,90,5],[69,0,69,9],[87,6,87,7],[88,8,88,9],[70,1,70,5],[90,8,90,9],[81,0,81,9],[78,6,78,7],[79,8,79,9]]}
["PPN",null,{"$f":"LATESTVERSION","v":"Version 2.4"},null,null,null,null,"<<<This button Loads the Project Data"]
[null,null,null,null,null,null,null,"<<<This button Stores the Loaded  Project Data"]
[null,null,null,null,null,null,null,null,null,null,null,null,false]
[null,null,null,null,null,null,null,null,null,null,null,null,false]
[]
[]
[]
["Operating Fund",null,null,null,null,null,"  U.S. Department of Housing and",null,null,null,null,null,false]
["Calculation of Operating Subsidy",null,null,null,null,null,"            Urban Development",null,null,null,null,null,false]
["PHA-Owned Rental Housing",null,null,null,null,null,"  Office of Public and Indian Housing",null,null,null,null,null,false]
{"$rows_left_out":163}
{"sheet":"Reference","index":3,"n_rows":3144,"n_cols":33,"rows_kept":3144,"cut":false,"hidden":true,"merged":[[21,31,22,40],[12,31,12,40],[13,31,13,40],[15,31,15,40],[16,32,16,40],[14,31,14,40]]}
[null,null,null,null,null,null,null,null,null,null,null,null,null,null,null,null,null,null,null,null,null,null,null,null,null,null,null,null,"LatestVersion>>>","Version 2.4"]
[null,null,"State","PHAs","State","PHA Code","PHA Name",null,"Funding Period","01/01/2015  to 12/31/2015",null,null,null,null,null,null,null,null,null,null,null,null,null,null,null,"State"]
[null,null,"AK",{"$f":"COUNTIF($E$3:$E$4000,C3)","v":0},{"$f":"IF(F3=\"\",\"\",LEFT(F3,2))","v":"CT"},"CT007","Housing Authority of the City of Stamford",null,null,null,null,null,null,null,null,null,null,null,null,null,null,null,null,null,"AL006","AK"]
[null,null,"AL",{"$f":"COUNTIF($E$3:$E$4000,C4)","v":0},{"$f":"IF(F4=\"\",\"\",LEFT(F4,2))","v":"FL"},"FL005","MIAMI DADE PUBLIC HOUSING AND COMMUNITY DEV",null,null,"Starting","Ending",null,null,null,null,null,null,null,null,null,null,"AK001","Yes",null,null,"AL"]
[null,null,"AR",0,"FL","FL009","WEST PALM BEACH HOUSING AUTHORITY",null,"AMP","al001",{"$f":"+_LC2","v":{"$error":"#NAME?"}},null,null,null,null,null,null,null,null,null,null,"AL001","No",null,null,"AR"]
[null,null,"AZ",0,"FL","FL075","CLEARWATER HOUSING AUTHORITY",null,"Row",{"$f":"IF(LEN(AMP)=5,MATCH(AMP,PHAS,0)+2,MATCH(AMP,DDAMP,0)+2)","v":{"$error":"#REF!"}},{"$f":"IF(LEN(_AMP2)=5,MATCH(_AMP2,PHAS,0)+2,MATCH(_AMP2,DDAMP,0)+2)","v":{"$error":"#NAME?"}},{"$f":"MATCH(_LC3,PrePop!$C$2:$C$7896,0)+2","v":{"$error":"#NAME?"}},null,null,null,null,null,null,null,null,null,"AL002","No",null,null,"AZ"]
[null,null,"CA",0,"GA","GA003","Housing Authority of the City of Athens",null,"Count",{"$f":"IF(LEN(AMP)=5,COUNTIF(PHAS,AMP),0)","v":{"$error":"#REF!"}},{"$f":"IF(LEN(_AMP2)=5,COUNTIF(PHAS,_AMP2),0)","v":{"$error":"#NAME?"}},null,null,null,null,null,null,null,null,null,null,"AL004","No",null,null,"CA"]
[null,null,"CO",0,"NC","NC001","Housing Authority of the City of Wilmington",null,"Cell Locations","AK001","WY015","NY011000012",null,null,null,null,null,null,null,null,null,"AL005","No",null,null,"CO"]
[null,null,"CT",1,"NC","NC004","Housing Authority of the City of Kinston",null,null,null,null,null,null,null,null,null,null,null,null,null,null,"AL006","No",null,null,"CT"]
[null,null,"DC",0,"NE","NE003","Hall County Housing Authority",null,null,null,null,null,null,null,null,null,null,null,null,null,null,"AL007","No",null,null,"DC"]
{"$rows_left_out":3135}
{"sheet":"Blank","index":4,"n_rows":0,"n_cols":0,"rows_kept":0,"cut":false,"hidden":false,"merged":[]}

{"sheet":"BOM_EOM","index":5,"n_rows":17,"n_cols":25,"rows_kept":17,"cut":false,"hidden":true,"merged":[[0,1,0,12],[0,13,0,24]]}
[null,"Beginning of Month",null,null,null,null,null,null,null,null,null,null,null,"End of Month"]
["PPN","HA_ACC_TOTAL","PL_01","PL_02","PL_05","PL_06","PL_07","PL_08","PL_09","PL_10","PL_11","PL_12","PL_13",{"$f":"+B2","v":"HA_ACC_TOTAL"},{"$f":"+C2","v":"PL_01"},"PL_02","PL_05","PL_06","PL_07","PL_08","PL_09","PL_10","PL_11","PL_12","PL_13"]
["CT007000009",502,0,0,0,0,0,0,0,0,0,0,0,502,0,0,0,0,0,0,0,0,0,0,0]
["FL005000853",9408,0,0,0,0,0,0,0,0,0,0,0,9408,0,0,0,0,0,0,0,0,0,0,0]
["FL005000854",9408,0,0,0,0,0,0,0,0,0,0,0,9408,0,0,0,0,0,0,0,0,0,0,0]
["FL009000056",302,0,0,0,0,0,0,0,0,0,0,0,302,0,0,0,0,0,0,0,0,0,0,0]
["FL075000007",205,0,0,0,0,0,0,0,0,0,0,0,205,0,0,0,0,0,0,0,0,0,0,0]
["GA003000015",1134,0,0,0,0,0,0,0,0,0,0,0,1134,0,0,0,0,0,0,0,0,0,0,0]
["NC001000021",1060,0,0,0,0,0,0,0,0,0,0,0,1060,0,0,0,0,0,0,0,0,0,0,0]
["NC004000009",711,0,0,0,0,0,0,0,0,0,0,0,711,0,0,0,0,0,0,0,0,0,0,0]
{"$rows_left_out":7}