{"text_format":"1","workbook":"xlsx","n_sheets":9,"sheets":["Sheet1","52722","Sheet2","UEL Header","UEL Details","Blank","Reference","UEL Header Prepop","UEL Details Prepop"],"not_rendered":{"charts":0,"images":17,"macros":1,"external_links":0,"defined_names":62,"comments":0,"pivot_tables":0},"unopened":[],"bounds":{"document_bytes":16777216,"sheet_cells":100000,"rows_first":2000,"rows_last":500,"rows_between":2000,"halvings":0,"cell_chars":16384,"cell_head_chars":4096},"cells_cut":0,"cells_raw":0,"read":"whole","date_system":"1900"}

{"sheet":"Sheet1","index":0,"n_rows":13,"n_cols":47,"rows_kept":13,"cut":false,"hidden":false,"merged":[]}
[]
[null,null,null,null,null,null,null,null,null,null,null,null,null,1,2,2,0,null,null,null,null,null,null,null,null,null,null,null,null,null,null,null,null,null,null,null,null,null,null,null,null,null,null,null,null,null,0]
[null,null,null,null,null,null,null,null,null,null,null,null,null,null,null,3]
[]
[]
[]
[]
[]
[]
[]
{"$rows_left_out":4}
{"sheet":"52722","index":1,"n_rows":57,"n_cols":18,"rows_kept":57,"cut":false,"hidden":false,"merged":[[14,1,14,4],[0,0,0,5],[1,0,1,5],[26,0,26,9],[26,10,26,11],[4,0,4,11],[21,0,21,11],[11,0,11,2],[11,6,11,8],[20,1,20,4],[3,0,3,4],[7,7,7,8],[8,5,8,6],[9,8,10,8],[6,0,6,11],[7,11,8,11],[7,10,8,10],[7,0,7,4],[7,5,7,6],[11,3,11,5],[12,3,12,5],[10,0,10,4],[12,0,12,2],[8,0,8,4],[56,0,79,11],[47,1,47,4],[43,0,43,11],[48,1,48,4],[54,1,54,4],[46,0,46,9],[44,1,44,4],[45,1,45,4],[55,0,55,11],[50,1,50,4],[51,1,51,4],[52,1,52,4],[53,1,53,4],[26,16,26,17],[46,16,46,17],[40,0,40,11],[35,1,35,4],[36,1,36,4],[37,0,37,11],[39,1,39,4],[38,1,38,4],[34,1,34,4],[33,1,33,4],[27,1,27,4],[28,1,28,4],[30,0,30,11],[29,1,29,4],[31,1,31,4],[32,0,32,11],[3,8,3,11],[41,1,41,4],[49,0,49,11],[42,1,42,4],[46,10,46,11],[19,1,19,4],[17,1,17,4],[18,0,18,11],[11,9,11,10],[22,1,22,4],[23,1,23,4],[25,1,25,4],[24,1,24,4],[16,1,16,4],[9,0,9,4],[15,1,15,4]]}
["Operating Fund",null,null,null,null,null,null,null,"U.S. Department of Housing and",null,null,{"$f":"\"Version \" & Version","v":"Version NP.22.1.0"}]
["Calculation of Utilities Expense Level",null,null,null,null,null,null,null,"Urban Development"]
["PHA-Owned Rental Housing",null,null,null,null,null,null,null,"Office of Public and Indian Housing"]
[null,null,null,null,null,null,null,null,"OMB Approval No. 2577-0029 (exp. 06/30/2017)"]
["Public Reporting Burden for this collection of information is estimated to average .75 hours per response, including the time for reviewing instructions, searching existing data sources, gathering and maintaining data needed, and completing and reviewing the collection of information.  This agency may not collect this information, and you are not required to complete this form, unless it displays a currently valid OMB control number.  This information is required by Section 9(a) of the U.S. Housing Act of 1937, as amended, and by 24 CFR Part 990 HUD regulations.  HUD makes payments for the operation and maintenance of low-income housing projects to PHAs.  The Operating Fund determines the amount of operating subsidy to be paid to PHAs.  PHAs provide information on the Project Expense Level (PEL), Utilities Expense Level (UEL), Other Formula Expenses (Add-ons) and Formula Income - the major Operating Fund components.  HUD reviews the information to determine each PHA's Formula Amount and the funds to be obligated for the period to each PHA based on the appropriation by Congress.  HUD also uses the information as the basis for requesting annual appropriations from Congress.  Responses to the collection of information are required to obtain a benefit.  The information requested does not lend itself to confidentiality."]
[]
["Section 1 - General Information"]
["1. Name of Public Housing Agency:",null,null,null,null,"2. Funding Period: ",null,"3. Type of Submission:",null,"4. Unit Change Indicator:","5. DUNS Number:","6. Rate Reduction Incentive:"]
[null,null,null,null,null,"1/1/2015   to  12/31/2015"]
[null,null,null,null,null,null,null,null,null,"No",null,"No"]
{"$rows_left_out":48}
{"sheet":"Sheet2","index":2,"n_rows":65,"n_cols":52,"rows_kept":65,"cut":false,"hidden":false,"merged":[]}
["Flat Rate",1,"Coal",3,"Pounds",null,"Coal",{"$f":"MATCH(G1,$C$1:$C$71,0)","v":1},"UOC_COAL","Linked Cells",null,null,null,null,"Linked Cells for",null,null,null,null,null,null,null,null,null,null,null,null,"Row #","Line #"]
["Frozen",2,null,null,"Tons",null,"Electricity",5,"UOC_ELEC",{"$f":"OFFSET(IncentiveTypes,IncentiveType1-1,0,1,1)","v":"Non Frozen"},2,null,null,null,"Incentive Type",null,null,null,null,null,null,null,null,null,null,null,null,15,null,{"$f":"+P2","v":0},{"$f":"+Q2","v":0},0,0,0,0,0,0,0,0,0,0,null,null,null,null,null,null,null,null,null,{"$f":"+AK7","v":0},0]
["Non Frozen",3,null,null,"Other",null,"Fuel Oil",8,"UOC_FUELOIL",{"$f":"OFFSET(UtilityTypes,K3-1,0,1,1)","v":"Coal"},1,null,null,null,"Unit of Consumption",null,null,null,null,null,null,null,null,null,null,null,null,16,null,{"$f":"+P4","v":0},{"$f":"+Q4","v":0},0,0,0,0,0,0,0,0,0,0,null,null,null,null,null,null,null,null,null,{"$f":"+AK8","v":0},0]
[null,null,null,null,null,null,"Gas",11,"UOC_GAS",{"$f":"OFFSET(UOCS,RowOne+UnitOfConsump1-1,0,1,1)","v":"Pounds"},1,null,null,null,"Utility Type",null,null,null,null,null,null,null,null,null,null,null,null,20,"01",{"$f":"+'52722'!F20","v":0},{"$f":"+'52722'!G20","v":0},{"$f":"+'52722'!H20","v":0},{"$f":"+'52722'!I20","v":0},{"$f":"+'52722'!J20","v":0},{"$f":"+'52722'!K20","v":0},{"$f":"+'52722'!L20","v":0},{"$f":"+'52722'!M20","v":0},{"$f":"+'52722'!N20","v":0},{"$f":"+'52722'!O20","v":0},{"$f":"+'52722'!P20","v":0},{"$f":"+'52722'!Q20","v":0},null,null,null,null,null,null,null,null,null,{"$f":"+'52722'!#REF!","v":{"$error":"#REF!"}},{"$f":"+'52722'!#REF!","v":{"$error":"#REF!"}}]
[null,1,"Electricity",2,"Kilowatt Hours (KWH)",null,"Propane",17,"UOC_PROPANE",null,null,null,null,null,null,null,null,null,null,null,null,null,null,null,null,null,null,21,"01A",{"$f":"+P9","v":""},{"$f":"+Q9","v":""},"","","","","","","","","","",null,null,null,null,null,null,null,null,null,0,0]
[null,2,null,null,"Other",null,"Sewer (if reported separately)",20,"UOC_SEWER","RowOne",{"$f":"OFFSET($H$1,TypeOfUtility1-1,0)-1","v":0},null,null,null,{"$f":"+O4&\" Range\"","v":"Utility Type Range"},{"$f":"VLOOKUP(P4,$G$1:$I$11,3,FALSE)","v":{"$error":"#N/A"}},{"$error":"#N/A"},{"$error":"#N/A"},{"$f":"VLOOKUP(S4,$G$1:$I$11,3,FALSE)","v":{"$error":"#N/A"}},{"$error":"#N/A"},{"$error":"#N/A"},{"$error":"#N/A"},{"$error":"#N/A"},{"$error":"#N/A"},{"$error":"#N/A"},{"$error":"#N/A"},{"$error":"#N/A"},23,"02",{"$f":"+'52722'!F23","v":0},{"$f":"+'52722'!G23","v":0},{"$f":"+'52722'!H23","v":0},{"$f":"+'52722'!I23","v":0},{"$f":"+'52722'!J23","v":0},{"$f":"+'52722'!K23","v":0},{"$f":"+'52722'!L23","v":0},{"$f":"+'52722'!M23","v":0},{"$f":"+'52722'!N23","v":0},{"$f":"+'52722'!O23","v":0},{"$f":"+'52722'!P23","v":0},{"$f":"+'52722'!Q23","v":0},null,null,null,null,null,null,null,null,null,{"$f":"+'52722'!#REF!","v":{"$error":"#REF!"}},{"$f":"+'52722'!#REF!","v":{"$error":"#REF!"}}]
[null,null,null,null,null,null,"Water and Sewer (if combined)",28,"UOC_BOTH","RowTwo",{"$f":"OFFSET($H$1,TypeOfUtility1,0)","v":5},null,null,null,{"$f":"\"Text \" &O2","v":"Text Incentive Type"},{"$f":"IF(P2>0,OFFSET(DDHDR,P2-1,0,1,1),\"\")","v":""},"","",{"$error":"#N/A"},"","","","","","","","",24,"03",{"$f":"+'52722'!F24","v":0},{"$f":"+'52722'!G24","v":0},{"$f":"+'52722'!H24","v":0},{"$f":"+'52722'!I24","v":0},{"$f":"+'52722'!J24","v":0},{"$f":"+'52722'!K24","v":0},{"$f":"+'52722'!L24","v":0},{"$f":"+'52722'!M24","v":0},{"$f":"+'52722'!N24","v":0},{"$f":"+'52722'!O24","v":0},{"$f":"+'52722'!P24","v":0},{"$f":"+'52722'!Q24","v":0},null,null,null,null,null,null,null,null,null,{"$f":"+'52722'!#REF!","v":{"$error":"#REF!"}},{"$f":"+'52722'!#REF!","v":{"$error":"#REF!"}}]
[null,1,"Fuel Oil",2,"Gallons",null,"Water (if reported separately)",36,"UOC_WATER","HowManyRows",{"$f":"+RowTwo-RowOne-2","v":3},null,null,null,{"$f":"\"Text \" &O4","v":"Text Utility Type"},{"$f":"IF(P$4>0,OFFSET(UtilityTypes,P$4-1,0,1,1),\"\")","v":""},"","",{"$f":"VLOOKUP(S6,$G$1:$I$11,3,FALSE)","v":{"$error":"#N/A"}},"","","","","","","","",25,"04",{"$f":"+'52722'!F25","v":0},{"$f":"+'52722'!G25","v":0},{"$f":"+'52722'!H25","v":0},{"$f":"+'52722'!I25","v":0},{"$f":"+'52722'!J25","v":0},{"$f":"+'52722'!K25","v":0},{"$f":"+'52722'!L25","v":0},{"$f":"+'52722'!M25","v":0},{"$f":"+'52722'!N25","v":0},{"$f":"+'52722'!O25","v":0},{"$f":"+'52722'!P25","v":0},{"$f":"+'52722'!Q25","v":0},null,null,null,null,null,null,null,null,null,{"$f":"+'52722'!#REF!","v":{"$error":"#REF!"}},{"$f":"+'52722'!#REF!","v":{"$error":"#REF!"}}]
[null,2,null,null,"Other",null,"Wood",44,"UOC_WOOD",null,null,null,null,null,{"$f":"\"Text \" &O3","v":"Text Unit of Consumption"},{"$f":"IF(P3>0,OFFSET(INDIRECT(P6),P$3-1,0,1,1),\"\")","v":""},"","","","","","","","","","","",26,"05",{"$f":"+'52722'!F26","v":0},{"$f":"+'52722'!G26","v":0},{"$f":"+'52722'!H26","v":0},{"$f":"+'52722'!I26","v":0},{"$f":"+'52722'!J26","v":0},{"$f":"+'52722'!K26","v":0},{"$f":"+'52722'!L26","v":0},{"$f":"+'52722'!M26","v":0},{"$f":"+'52722'!N26","v":0},{"$f":"+'52722'!O26","v":0},{"$f":"+'52722'!P26","v":0},{"$f":"+'52722'!Q26","v":0},null,null,null,null,null,null,null,null,null,{"$f":"+'52722'!AA26","v":0},{"$f":"+'52722'!AB26","v":0}]
[null,null,null,null,null,null,"Steam",47,"UOC_STEAM",null,null,null,null,null,null,null,null,null,null,null,null,null,null,null,null,null,null,28,"06",{"$f":"+'52722'!F28","v":0},{"$f":"+'52722'!G28","v":0},{"$f":"+'52722'!H28","v":0},{"$f":"+'52722'!I28","v":0},{"$f":"+'52722'!J28","v":0},{"$f":"+'52722'!K28","v":0},{"$f":"+'52722'!L28","v":0},{"$f":"+'52722'!M28","v":0},{"$f":"+'52722'!N28","v":0},{"$f":"+'52722'!O28","v":0},{"$f":"+'52722'!P28","v":0},{"$f":"+'52722'!Q28","v":0},null,null,null,null,null,null,null,null,null,{"$f":"+'52722'!AA28","v":0},{"$f":"+'52722'!AB28","v":0}]
{"$rows_left_out":56}
{"sheet":"UEL Header","index":3,"n_rows":18,"n_cols":21,"rows_kept":18,"cut":false,"hidden":false,"merged":[]}
["PPN","HAName","ACC","DUNS","ROFO","FYE","UnitChangeInd","RRIYN","StudyYear","BaseUtilityExpenseLevel","UtilitySurcharges","BaseMinusSurcharge","UtiliyInflationDeflationFactor","UELAdjustedForInflation","EnergyRateIncentive","UEL","EligibleUnitMonths","FinalUEL","addr1","addr2","comments"]
["Please Select PPN",null,null,null,null,null,false,false]
[]
[]
[]
[]
[]
[]
[]
[]
{"$rows_left_out":9}
{"sheet":"UEL Details","index":4,"n_rows":13,"n_cols":23,"rows_kept":13,"cut":false,"hidden":false,"merged":[]}
["PPN","FundingYear","UtilityCategory","UtilityType","ActualConsumption","UnitOfConsumption","ActualConsumptionYear-1","ActualConsumptionYear-2","ActualConsumptionYear-3","ActualConsumptionTotal","ActualConsumptionAvg","ActualConsumptionNewUnits","RollingBaseConsumption","BaseConsumptionMinusCalculated","CalculatedLine10","CalculatedLine11","CalculatedLine12","CalculatedLine13","AnnualizedComsumptionNewUnits","CalculatedLine15","ActualUtilityCosts","CalculatedLine17","CalculatedLine18"]
["Please Select PPN"]
["Please Select PPN"]
["Please Select PPN"]
["Please Select PPN"]
["Please Select PPN"]
["Please Select PPN"]
["Please Select PPN"]
["Please Select PPN"]
["Please Select PPN"]
{"$rows_left_out":4}
{"sheet":"Blank","index":5,"n_rows":0,"n_cols":0,"rows_kept":0,"cut":false,"hidden":false,"merged":[]}

{"sheet":"Reference","index":6,"n_rows":3144,"n_cols":60,"rows_kept":3144,"cut":false,"hidden":false,"merged":[]}
[null,null,null,null,null,null,null,null,null,null,null,null,null,null,"NP.22.1.0",null,null,null,null,null,null,null,null,null,null,null,null,null,"LatestVersion>>>","Version 22.NP.1.0",null,null,null,null,null,null,null,null,null,null,null,null,null,null,null,null,null,null,null,null,null,null,"PPN","HAName"]
["State","PHAs","State","PHAs","State",null,null,null,"Funding Period","01/01/2015-12/31/2015",null,null,null,null,null,null,"AL004",null,null,null,null,null,null,null,null,"State",null,null,null,null,"Done","Started","Open",null,null,null,null,null,null,null,null,null,null,null,null,null,null,null,null,null,null,null,"Please Select PPN",null,null,null,null,null,"PHA"]
["AK",null,"AK",{"$f":"COUNTIF($E$3:$E$4000,A3)","v":0},{"$f":"LEFT(F3,2)","v":"AL"},"AL005",{"$f":"VLOOKUP(F3,$AY3:$BB$50,4,FALSE)","v":"Phoenix City HA"},null,null,null,null,null,null,null,null,null,"AL004",null,null,null,null,null,null,null,"AL006","AK",null,null,null,null,"2012-04-01",null,null,null,null,null,null,null,null,null,null,null,null,null,null,null,null,null,null,null,"AL005","AL005000018","@AL005000018","Phoenix City HA",null,null,null,null,"AL005",{"$f":"VLOOKUP(BG3,$AY3:$BB$50,4,FALSE)","v":"Phoenix City HA"}]
["AL",null,"AL",{"$f":"COUNTIF($E$3:$E$4000,A4)","v":2},"AL","AL190",{"$f":"VLOOKUP(F4,$AY4:$BB$50,4,FALSE)","v":"Housing Authority of Greene County, Al"},null,null,"Starting","Ending",null,null,null,null,null,"AL004",null,null,null,null,"AK001","Yes",null,null,"AL",null,null,null,null,null,"Used latest 52723 PHA tool as a starting point",null,null,null,null,null,null,null,null,null,null,null,null,null,null,null,null,null,null,"AL190","AL190000004","@AL190000004","Housing Authority of Greene County, Al",null,null,null,null,"AL190",{"$f":"VLOOKUP(BG4,$AY4:$BB$50,4,FALSE)","v":"Housing Authority of Greene County, Al"}]
["AR",null,"AR",0,"FL","FL003",{"$f":"VLOOKUP(F5,$AY5:$BB$50,4,FALSE)","v":"Tampa Housing Authority"},null,"AMP","al001",{"$f":"+_LC2","v":{"$error":"#NAME?"}},null,null,null,null,null,"AL004",null,null,null,null,"AL001","No",null,null,"AR",null,null,null,null,null,"Replaced Excel /Data/Filter/Advanced with vba to generate PHA list",null,null,null,null,null,null,null,null,null,null,null,null,null,null,null,null,null,null,"FL003","FL003000043","@FL003000043","Tampa Housing Authority",null,null,null,null,"FL003",{"$f":"VLOOKUP(BG5,$AY5:$BB$50,4,FALSE)","v":"Tampa Housing Authority"}]
["AZ",null,"AZ",0,"FL","FL005",{"$f":"VLOOKUP(F6,$AY6:$BB$50,4,FALSE)","v":"Miami Dade Housing"},null,"Row",{"$error":"#NAME?"},{"$f":"IF(LEN(_AMP2)=5,MATCH(_AMP2,PHAS,0)+2,MATCH(_AMP2,DDAMP,0)+2)","v":{"$error":"#NAME?"}},{"$f":"MATCH(_LC3,#REF!,0)+2","v":{"$error":"#NAME?"}},null,null,null,null,"AL004",null,null,null,null,"AL002","No",null,null,"AZ",null,null,null,null,null,"Redefined object references to reflect header/details (for UEL) vs 1 sheet for 23 form  ",null,null,null,null,null,null,null,null,null,null,null,null,null,null,null,null,null,null,"FL005","FL005000848","@FL005000848","Miami Dade Housing",null,null,null,null,"FL005",{"$f":"VLOOKUP(BG6,$AY6:$BB$50,4,FALSE)","v":"Miami Dade Housing"}]
["CA",null,"CA",0,"FL","FL021",{"$f":"VLOOKUP(F7,$AY7:$BB$50,4,FALSE)","v":"Pahokee Housing Authority"},null,"Count",{"$error":"#NAME?"},{"$f":"IF(LEN(_AMP2)=5,COUNTIF(PHAS,_AMP2),0)","v":{"$error":"#NAME?"}},null,null,null,null,null,"AL004",null,null,null,null,"AL004","No",null,null,"CA",null,null,null,null,null,"Code executes properly for web based up thru actually selecting a pha and transferring data to prepop sheets",null,null,null,null,null,null,null,null,null,null,null,null,null,null,null,null,null,null,"FL005","FL005000849","@FL005000849","Miami Dade Housing",null,null,null,null,"FL021",{"$f":"VLOOKUP(BG7,$AY7:$BB$50,4,FALSE)","v":"Pahokee Housing Authority"}]
["CO",null,"CO",0,"FL","FL062",{"$f":"VLOOKUP(F8,$AY8:$BB$50,4,FALSE)","v":"Pinellas County Housing Authority"},null,"Cell Locations","AK001","WY015",null,null,null,null,null,"AL004",null,null,null,null,"AL005","No",null,null,"CO",null,null,null,null,null,"Added 'latestversion' to 22 form A4",null,null,null,null,null,null,null,null,null,null,null,null,null,null,null,null,null,null,"FL005","FL005000850","@FL005000850","Miami Dade Housing",null,null,null,null,"FL062",{"$f":"VLOOKUP(BG8,$AY8:$BB$50,4,FALSE)","v":"Pinellas County Housing Authority"}]
["CT",null,"CT",0,"IN","IN003",{"$f":"VLOOKUP(F9,$AY9:$BB$50,4,FALSE)","v":"Fort Wayne "},null,null,null,null,null,null,null,null,null,"AL004",null,null,null,null,"AL006","No",null,null,"CT",null,null,null,null,null,null,null,null,null,null,null,null,null,null,null,null,null,null,null,null,null,null,null,null,"FL005","FL005000851","@FL005000851","Miami Dade Housing",null,null,null,null,"IN003",{"$f":"VLOOKUP(BG9,$AY9:$BB$50,4,FALSE)","v":"Fort Wayne "}]
["DC",null,"DC",0,"LA","LA004",{"$f":"VLOOKUP(F10,$AY10:$BB$50,4,FALSE)","v":"Housing Authority of Lake Charles"},null,null,null,null,null,null,null,null,null,"AL004",null,null,null,null,"AL007","No",null,null,"DC",null,null,null,"Version 22.NP.1.0","1/10/1015","Changed latest 2015 Main Tool v. 2.04 into New Project Tool - MJC",null,null,null,null,null,null,null,null,null,null,null,null,null,null,null,null,null,null,"FL005","FL005000852","@FL005000852","Miami Dade Housing",null,null,null,null,"LA004",{"$f":"VLOOKUP(BG10,$AY10:$BB$50,4,FALSE)","v":"Housing Authority of Lake Charles"}]
{"$rows_left_out":3135}
{"sheet":"UEL Header Prepop","index":7,"n_rows":50,"n_cols":21,"rows_kept":50,"cut":false,"hidden":false,"merged":[]}
["PPN","HAName","ACC","DUNS","ROFO","FYE","UnitChangeInd","RRIYN","StudyYear","BaseUtilityExpenseLevel","UtilitySurcharges","BaseMinusSurcharge","UtiliyInflationDeflationFactor","UELAdjustedForInflation","EnergyRateIncentive","UEL","EligibleUnitMonths","FinalUEL","addr1","addr2","comments"]
["Please Select PPN",null,null,null,null,null,false,false]
["@AL005000018","Phoenix City HA","A-3799","052630282","0409","2013-09-30","FALSE","FALSE","7/1/2013-6/30/2014","","","",1.0563,"","","","","","PO Box 338","Phenix City, AL 36868",""]
["@AL190000004","Housing Authority of Greene County, Al","A2129","627191398","0409","2013-12-31","FALSE","FALSE","7/1/2013-6/30/2014","","","",1.0563,"","","","","","Post Office Box 389","Eutaw, AL 35462",""]
["@FL003000043","Tampa Housing Authority","A-4325","025637356","0414","2014-03-31","FALSE","FALSE","7/1/2013-6/30/2014","","","",1.0563,"","","","","","1529 W Main Street","Tampa, FL 33607",""]
["@FL005000848","Miami Dade Housing","A-4252","136721177","0414","2014-09-30","FALSE","FALSE","7/1/2013-6/30/2014","","","",1.0563,"","","","","","701 NW 1st Court","Miami, FL 33136",""]
["@FL005000849","Miami Dade Housing","A-4252","136721177","0414","2014-09-30","FALSE","FALSE","7/1/2013-6/30/2014","","","",1.0563,"","","","","","701 NW 1st Court","Miami, FL 33136",""]
["@FL005000850","Miami Dade Housing","A-4252","136721177","0414","2014-09-30","FALSE","FALSE","7/1/2013-6/30/2014","","","",1.0563,"","","","","","701 NW 1st Court","Miami, FL 33136",""]
["@FL005000851","Miami Dade Housing","A-4252","136721177","0414","2014-09-30","FALSE","FALSE","7/1/2013-6/30/2014","","","",1.0563,"","","","","","701 NW 1st Court","Miami, FL 33136",""]
["@FL005000852","Miami Dade Housing","A-4252","136721177","0414","2014-09-30","FALSE","FALSE","7/1/2013-6/30/2014","","","",1.0563,"","","","","","701 NW 1st Court","Miami, FL 33136",""]
{"$rows_left_out":41}
{"sheet":"UEL Details Prepop","index":8,"n_rows":589,"n_cols":23,"rows_kept":589,"cut":false,"hidden":false,"merged":[]}
["PPN","FundingYear","UtilityCategory","UtilityType","ActualConsumption","UnitOfConsumption","ActualConsumptionYear-1","ActualConsumptionYear-2","ActualConsumptionYear-3","ActualConsumptionTotal","ActualConsumptionAvg","ActualConsumptionNewUnits","RollingBaseConsumption","BaseConsumptionMinusCalculated","CalculatedLine10","CalculatedLine11","CalculatedLine12","CalculatedLine13","AnnualizedComsumptionNewUnits","CalculatedLine15","ActualUtilityCosts","CalculatedLine17","CalculatedLine18"]
["Please Select PPN",null,null,null,null,null,0]
["Please Select PPN",null,null,null,null,null,0]
["Please Select PPN",null,null,null,null,null,0]
["Please Select PPN",null,null,null,null,null,0]
["Please Select PPN",null,null,null,null,null,0]
["Please Select PPN",null,null,null,null,null,0]
["Please Select PPN",null,null,null,null,null,0]
["Please Select PPN",null,null,null,null,null,0]
["Please Select PPN",null,null,null,null,null,0]
{"$rows_left_out":579}