{"text_format":"1","workbook":"xlsx","n_sheets":9,"sheets":["Sheet1","52722","Sheet2","UEL Header","UEL Details","Blank","Reference","UEL Header Prepop","UEL Details Prepop"],"not_rendered":{"charts":0,"images":17,"macros":1,"external_links":0,"defined_names":62,"comments":0,"pivot_tables":0},"unopened":[],"bounds":{"document_bytes":16777216,"sheet_cells":100000,"rows_first":2000,"rows_last":500,"rows_between":2000,"halvings":0,"cell_chars":16384,"cell_head_chars":4096},"cells_cut":0,"cells_raw":0,"read":"whole","date_system":"1900"}

{"sheet":"Sheet1","index":0,"n_rows":13,"n_cols":47,"rows_kept":13,"cut":false,"hidden":false,"merged":[]}
[]
[null,null,null,null,null,null,null,null,null,null,null,null,null,1,2,2,0,null,null,null,null,null,null,null,null,null,null,null,null,null,null,null,null,null,null,null,null,null,null,null,null,null,null,null,null,null,0]
[null,null,null,null,null,null,null,null,null,null,null,null,null,null,null,3]
[]
[]
[]
[]
[]
[]
[]
[]
[]
[null,null,null,"AK001000247"]

{"sheet":"52722","index":1,"n_rows":57,"n_cols":18,"rows_kept":57,"cut":false,"hidden":false,"merged":[[14,1,14,4],[0,0,0,5],[1,0,1,5],[26,0,26,9],[26,10,26,11],[4,0,4,11],[21,0,21,11],[11,0,11,2],[11,6,11,8],[20,1,20,4],[3,0,3,4],[7,7,7,8],[8,5,8,6],[9,8,10,8],[6,0,6,11],[7,11,8,11],[7,10,8,10],[7,0,7,4],[7,5,7,6],[11,3,11,5],[12,3,12,5],[10,0,10,4],[12,0,12,2],[8,0,8,4],[56,0,79,11],[47,1,47,4],[43,0,43,11],[48,1,48,4],[54,1,54,4],[46,0,46,9],[44,1,44,4],[45,1,45,4],[55,0,55,11],[50,1,50,4],[51,1,51,4],[52,1,52,4],[53,1,53,4],[26,16,26,17],[46,16,46,17],[40,0,40,11],[35,1,35,4],[36,1,36,4],[37,0,37,11],[39,1,39,4],[38,1,38,4],[34,1,34,4],[33,1,33,4],[27,1,27,4],[28,1,28,4],[30,0,30,11],[29,1,29,4],[31,1,31,4],[32,0,32,11],[3,8,3,11],[41,1,41,4],[49,0,49,11],[42,1,42,4],[46,10,46,11],[19,1,19,4],[17,1,17,4],[18,0,18,11],[11,9,11,10],[22,1,22,4],[23,1,23,4],[25,1,25,4],[24,1,24,4],[16,1,16,4],[9,0,9,4],[15,1,15,4]]}
["Operating Fund",null,null,null,null,null,null,null,"U.S. Department of Housing and",null,null,{"$f":"\"Version \" & Version","v":"Version NP.22.1.0"}]
["Calculation of Utilities Expense Level",null,null,null,null,null,null,null,"Urban Development"]
["PHA-Owned Rental Housing",null,null,null,null,null,null,null,"Office of Public and Indian Housing"]
[null,null,null,null,null,null,null,null,"OMB Approval No. 2577-0029 (exp. 06/30/2017)"]
["Public Reporting Burden for this collection of information is estimated to average .75 hours per response, including the time for reviewing instructions, searching existing data sources, gathering and maintaining data needed, and completing and reviewing the collection of information.  This agency may not collect this information, and you are not required to complete this form, unless it displays a currently valid OMB control number.  This information is required by Section 9(a) of the U.S. Housing Act of 1937, as amended, and by 24 CFR Part 990 HUD regulations.  HUD makes payments for the operation and maintenance of low-income housing projects to PHAs.  The Operating Fund determines the amount of operating subsidy to be paid to PHAs.  PHAs provide information on the Project Expense Level (PEL), Utilities Expense Level (UEL), Other Formula Expenses (Add-ons) and Formula Income - the major Operating Fund components.  HUD reviews the information to determine each PHA's Formula Amount and the funds to be obligated for the period to each PHA based on the appropriation by Congress.  HUD also uses the information as the basis for requesting annual appropriations from Congress.  Responses to the collection of information are required to obtain a benefit.  The information requested does not lend itself to confidentiality."]
[]
["Section 1 - General Information"]
["1. Name of Public Housing Agency:",null,null,null,null,"2. Funding Period: ",null,"3. Type of Submission:",null,"4. Unit Change Indicator:","5. DUNS Number:","6. Rate Reduction Incentive:"]
[null,null,null,null,null,"1/1/2015   to  12/31/2015"]
[null,null,null,null,null,null,null,null,null,"No",null,"No"]
[]
["7. ACC Number:",null,null,"8. Operating Fund Project Number:",null,null,"9. Fiscal Year End:",null,null,"10. ROFO Code (HUD Use Only):"]
[null,null,null,"Please Select PPN"]
[]
[null,"Incentive Type",null,null,null,{"$f":"Sheet2!P2","v":0},{"$f":"Sheet2!Q2","v":0},{"$f":"Sheet2!R2","v":0},{"$f":"Sheet2!S2","v":0},{"$f":"Sheet2!T2","v":0},{"$f":"Sheet2!U2","v":0},{"$f":"Sheet2!V2","v":0},{"$f":"Sheet2!W2","v":0},{"$f":"Sheet2!X2","v":0},{"$f":"Sheet2!Y2","v":0},{"$f":"Sheet2!Z2","v":0},{"$f":"Sheet2!AA2","v":0}]
["Line No.","Utility Type",null,null,null,null,null,null,null,null,null,null,null,null,null,null,null,"Total"]
[null,"Description"]
["A","B",null,null,null,"C","D","E","F","G","H","I","J","K","L","M","N","O"]
["Section 2 - Current consumption Level"]
["01","Actual Consumption (12-month period 7/1/2013 to 6/30/2014",null,null,null,0,0,0,0,0,0,0,0,0,0,0,0]
["01a","Unit of consumption (e.g., gallons, kWh, therms)"]
["Section 3 - Rolling Base consumption Level"]
["02","Rolling base year 1 - actual consumption (12-month period 7/1/2012 to 6/30/2013)",null,null,null,{"$f":"IF(F15=\"Flat Rate\",\"Flat Rate\",0)","v":0},0,0,0,0,0,0,0,0,0,0,0]
["03","Rolling base year 2 - actual consumption (12-month period 7/1/2011 to 6/30/2012)",null,null,null,{"$f":"IF(F15=\"Flat Rate\",\"Flat Rate\",IF(F15=\"Frozen\",F23,0) )","v":0},0,0,0,0,0,0,0,0,0,0,0]
["04","Rolling base year 3 - actual consumption (12-month period 7/1/2010 to 6/30/2011)",null,null,null,{"$f":"IF(F15=\"Flat Rate\",\"Flat Rate\",IF(F15=\"Frozen\",F23,0) )","v":0},0,0,0,0,0,0,0,0,0,0,0]
["05","Total Consumption during 3-year Rolling Base period (Lines 02 + 03 + 04)",null,null,null,{"$f":"IF(F15=\"Flat Rate\",\"Flat Rate\",SUM(ROUND(dummynz(F23),0),ROUND(dummynz(F24),0),ROUND(dummynz(F25),0)))","v":0},{"$f":"IF(G15=\"Flat Rate\",\"Flat Rate\",SUM(ROUND(dummynz(G23),0),ROUND(dummynz(G24),0),ROUND(dummynz(G25),0)))","v":0},{"$f":"IF(H15=\"Flat Rate\",\"Flat Rate\",SUM(ROUND(dummynz(H23),0),ROUND(dummynz(H24),0),ROUND(dummynz(H25),0)))","v":0},{"$f":"IF(I15=\"Flat Rate\",\"Flat Rate\",SUM(ROUND(dummynz(I23),0),ROUND(dummynz(I24),0),ROUND(dummynz(I25),0)))","v":0},{"$f":"IF(J15=\"Flat Rate\",\"Flat Rate\",SUM(ROUND(dummynz(J23),0),ROUND(dummynz(J24),0),ROUND(dummynz(J25),0)))","v":0},{"$f":"IF(K15=\"Flat Rate\",\"Flat Rate\",SUM(ROUND(dummynz(K23),0),ROUND(dummynz(K24),0),ROUND(dummynz(K25),0)))","v":0},{"$f":"IF(L15=\"Flat Rate\",\"Flat Rate\",SUM(ROUND(dummynz(L23),0),ROUND(dummynz(L24),0),ROUND(dummynz(L25),0)))","v":0},{"$f":"IF(M15=\"Flat Rate\",\"Flat Rate\",SUM(ROUND(dummynz(M23),0),ROUND(dummynz(M24),0),ROUND(dummynz(M25),0)))","v":0},{"$f":"IF(N15=\"Flat Rate\",\"Flat Rate\",SUM(ROUND(dummynz(N23),0),ROUND(dummynz(N24),0),ROUND(dummynz(N25),0)))","v":0},{"$f":"IF(O15=\"Flat Rate\",\"Flat Rate\",SUM(ROUND(dummynz(O23),0),ROUND(dummynz(O24),0),ROUND(dummynz(O25),0)))","v":0},{"$f":"IF(P15=\"Flat Rate\",\"Flat Rate\",SUM(ROUND(dummynz(P23),0),ROUND(dummynz(P24),0),ROUND(dummynz(P25),0)))","v":0},{"$f":"IF(Q15=\"Flat Rate\",\"Flat Rate\",SUM(ROUND(dummynz(Q23),0),ROUND(dummynz(Q24),0),ROUND(dummynz(Q25),0)))","v":0}]
[null,null,null,null,null,null,null,null,null,null,{"$f":"CONCATENATE(\"Operating Fund Project Number \",$D$13)","v":"Operating Fund Project Number Please Select PPN"},null,null,null,null,null,{"$f":"CONCATENATE(\"Operating Fund Project Number \",$D$13)","v":"Operating Fund Project Number Please Select PPN"}]
["06","Average rolling base consumption (Line 05 ¸ 3)",null,null,null,{"$f":"IF(F15=\"Flat Rate\",\"Flat Rate\",AVERAGE(ROUND(dummynz(F23),0),ROUND(dummynz(F24),0),ROUND(dummynz(F25),0)))","v":0},{"$f":"IF(G15=\"Flat Rate\",\"Flat Rate\",AVERAGE(ROUND(dummynz(G23),0),ROUND(dummynz(G24),0),ROUND(dummynz(G25),0)))","v":0},{"$f":"IF(H15=\"Flat Rate\",\"Flat Rate\",AVERAGE(ROUND(dummynz(H23),0),ROUND(dummynz(H24),0),ROUND(dummynz(H25),0)))","v":0},{"$f":"IF(I15=\"Flat Rate\",\"Flat Rate\",AVERAGE(ROUND(dummynz(I23),0),ROUND(dummynz(I24),0),ROUND(dummynz(I25),0)))","v":0},{"$f":"IF(J15=\"Flat Rate\",\"Flat Rate\",AVERAGE(ROUND(dummynz(J23),0),ROUND(dummynz(J24),0),ROUND(dummynz(J25),0)))","v":0},{"$f":"IF(K15=\"Flat Rate\",\"Flat Rate\",AVERAGE(ROUND(dummynz(K23),0),ROUND(dummynz(K24),0),ROUND(dummynz(K25),0)))","v":0},{"$f":"IF(L15=\"Flat Rate\",\"Flat Rate\",AVERAGE(ROUND(dummynz(L23),0),ROUND(dummynz(L24),0),ROUND(dummynz(L25),0)))","v":0},{"$f":"IF(M15=\"Flat Rate\",\"Flat Rate\",AVERAGE(ROUND(dummynz(M23),0),ROUND(dummynz(M24),0),ROUND(dummynz(M25),0)))","v":0},{"$f":"IF(N15=\"Flat Rate\",\"Flat Rate\",AVERAGE(ROUND(dummynz(N23),0),ROUND(dummynz(N24),0),ROUND(dummynz(N25),0)))","v":0},{"$f":"IF(O15=\"Flat Rate\",\"Flat Rate\",AVERAGE(ROUND(dummynz(O23),0),ROUND(dummynz(O24),0),ROUND(dummynz(O25),0)))","v":0},{"$f":"IF(P15=\"Flat Rate\",\"Flat Rate\",AVERAGE(ROUND(dummynz(P23),0),ROUND(dummynz(P24),0),ROUND(dummynz(P25),0)))","v":0},{"$f":"IF(Q15=\"Flat Rate\",\"Flat Rate\",AVERAGE(ROUND(dummynz(Q23),0),ROUND(dummynz(Q24),0),ROUND(dummynz(Q25),0)))","v":0}]
["07","Actual consumption for new units",null,null,null,{"$f":"IF(F15=\"Flat Rate\",\"Flat Rate\",0)","v":0},0,0,0,0,0,0,0,0,0,0,0]
["08","Rolling Base Consumption (Line 06 + 07)",null,null,null,{"$f":"IF(F15=\"Flat Rate\",\"Flat Rate\",SUM(ROUND(F28,0),ROUND(F29,0)))","v":0},{"$f":"IF(G15=\"Flat Rate\",\"Flat Rate\",SUM(ROUND(G28,0),ROUND(G29,0)))","v":0},0,0,0,0,0,0,0,0,0,0]
["Section 4 - Base Consumption"]
["09","Base Consumption (lesser of Line 01 or 08)",null,null,null,{"$f":"IF(F15=\"Flat Rate\",\"Flat Rate\",IF(F$15=\"Frozen\",F30,MIN(dummynz(F20),dummynz(F30))))","v":0},{"$f":"IF(G15=\"Flat Rate\",\"Flat Rate\",IF(G$15=\"Frozen\",G30,MIN(dummynz(G20),dummynz(G30))))","v":0},{"$f":"IF(H15=\"Flat Rate\",\"Flat Rate\",IF(H$15=\"Frozen\",H30,MIN(dummynz(H20),dummynz(H30))))","v":0},{"$f":"IF(I15=\"Flat Rate\",\"Flat Rate\",IF(I$15=\"Frozen\",I30,MIN(dummynz(I20),dummynz(I30))))","v":0},{"$f":"IF(J15=\"Flat Rate\",\"Flat Rate\",IF(J$15=\"Frozen\",J30,MIN(dummynz(J20),dummynz(J30))))","v":0},{"$f":"IF(K15=\"Flat Rate\",\"Flat Rate\",IF(K$15=\"Frozen\",K30,MIN(dummynz(K20),dummynz(K30))))","v":0},{"$f":"IF(L15=\"Flat Rate\",\"Flat Rate\",IF(L$15=\"Frozen\",L30,MIN(dummynz(L20),dummynz(L30))))","v":0},{"$f":"IF(M15=\"Flat Rate\",\"Flat Rate\",IF(M$15=\"Frozen\",M30,MIN(dummynz(M20),dummynz(M30))))","v":0},{"$f":"IF(N15=\"Flat Rate\",\"Flat Rate\",IF(N$15=\"Frozen\",N30,MIN(dummynz(N20),dummynz(N30))))","v":0},{"$f":"IF(O15=\"Flat Rate\",\"Flat Rate\",IF(O$15=\"Frozen\",O30,MIN(dummynz(O20),dummynz(O30))))","v":0},{"$f":"IF(P15=\"Flat Rate\",\"Flat Rate\",IF(P$15=\"Frozen\",P30,MIN(dummynz(P20),dummynz(P30))))","v":0},{"$f":"IF(Q15=\"Flat Rate\",\"Flat Rate\",IF(Q$15=\"Frozen\",Q30,MIN(dummynz(Q20),dummynz(Q30))))","v":0}]
["Section 5 - Utility Consumption Incentive"]
["10","Actual consumption > rolling base (If Line 01 is greater than Line 08, enter the difference as positive; if not, enter 0)",null,null,null,{"$f":"IF(F$15=\"Flat Rate\",\"Flat Rate\",IF(F$15=\"Non Frozen\",MAX(dummynz(F20)-F30,0),0))","v":0},{"$f":"IF(G$15=\"Flat Rate\",\"Flat Rate\",IF(G$15=\"Non Frozen\",MAX(dummynz(G20)-G30,0),0))","v":0},{"$f":"IF(H$15=\"Flat Rate\",\"Flat Rate\",IF(H$15=\"Non Frozen\",MAX(dummynz(H20)-H30,0),0))","v":0},{"$f":"IF(I$15=\"Flat Rate\",\"Flat Rate\",IF(I$15=\"Non Frozen\",MAX(dummynz(I20)-I30,0),0))","v":0},{"$f":"IF(J$15=\"Flat Rate\",\"Flat Rate\",IF(J$15=\"Non Frozen\",MAX(dummynz(J20)-J30,0),0))","v":0},{"$f":"IF(K$15=\"Flat Rate\",\"Flat Rate\",IF(K$15=\"Non Frozen\",MAX(dummynz(K20)-K30,0),0))","v":0},{"$f":"IF(L$15=\"Flat Rate\",\"Flat Rate\",IF(L$15=\"Non Frozen\",MAX(dummynz(L20)-L30,0),0))","v":0},{"$f":"IF(M$15=\"Flat Rate\",\"Flat Rate\",IF(M$15=\"Non Frozen\",MAX(dummynz(M20)-M30,0),0))","v":0},{"$f":"IF(N$15=\"Flat Rate\",\"Flat Rate\",IF(N$15=\"Non Frozen\",MAX(dummynz(N20)-N30,0),0))","v":0},{"$f":"IF(O$15=\"Flat Rate\",\"Flat Rate\",IF(O$15=\"Non Frozen\",MAX(dummynz(O20)-O30,0),0))","v":0},{"$f":"IF(P$15=\"Flat Rate\",\"Flat Rate\",IF(P$15=\"Non Frozen\",MAX(dummynz(P20)-P30,0),0))","v":0},{"$f":"IF(Q$15=\"Flat Rate\",\"Flat Rate\",IF(Q$15=\"Non Frozen\",MAX(dummynz(Q20)-Q30,0),0))","v":0}]
["11","Actual consumption < rolling base (If Line 01 is less than Line 08, enter the difference as positive; if not, enter 0)",null,null,null,{"$f":"IF(F15=\"Flat Rate\",\"Flat Rate\",IF(F$15=\"Non Frozen\",MAX(F30-dummynz(F20),0),0))","v":0},{"$f":"IF(G15=\"Flat Rate\",\"Flat Rate\",IF(G$15=\"Non Frozen\",MAX(G30-dummynz(G20),0),0))","v":0},{"$f":"IF(H15=\"Flat Rate\",\"Flat Rate\",IF(H$15=\"Non Frozen\",MAX(H30-dummynz(H20),0),0))","v":0},{"$f":"IF(I15=\"Flat Rate\",\"Flat Rate\",IF(I$15=\"Non Frozen\",MAX(I30-dummynz(I20),0),0))","v":0},{"$f":"IF(J15=\"Flat Rate\",\"Flat Rate\",IF(J$15=\"Non Frozen\",MAX(J30-dummynz(J20),0),0))","v":0},{"$f":"IF(K15=\"Flat Rate\",\"Flat Rate\",IF(K$15=\"Non Frozen\",MAX(K30-dummynz(K20),0),0))","v":0},{"$f":"IF(L15=\"Flat Rate\",\"Flat Rate\",IF(L$15=\"Non Frozen\",MAX(L30-dummynz(L20),0),0))","v":0},{"$f":"IF(M15=\"Flat Rate\",\"Flat Rate\",IF(M$15=\"Non Frozen\",MAX(M30-dummynz(M20),0),0))","v":0},{"$f":"IF(N15=\"Flat Rate\",\"Flat Rate\",IF(N$15=\"Non Frozen\",MAX(N30-dummynz(N20),0),0))","v":0},{"$f":"IF(O15=\"Flat Rate\",\"Flat Rate\",IF(O$15=\"Non Frozen\",MAX(O30-dummynz(O20),0),0))","v":0},{"$f":"IF(P15=\"Flat Rate\",\"Flat Rate\",IF(P$15=\"Non Frozen\",MAX(P30-dummynz(P20),0),0))","v":0},{"$f":"IF(Q15=\"Flat Rate\",\"Flat Rate\",IF(Q$15=\"Non Frozen\",MAX(Q30-dummynz(Q20),0),0))","v":0}]
["12","75%/25% Split (Line 10 x 0.25)",null,null,null,{"$f":"IF(F15=\"Flat Rate\",\"Flat Rate\",IF(F$15=\"Non Frozen\",ROUND(F34*0.25,0),0))","v":0},0,0,0,0,0,0,0,0,0,0,0]
["13","75%/25% Split (Line 11 x 0.75)",null,null,null,{"$f":"IF(F15=\"Flat Rate\",\"Flat Rate\",IF(F$15=\"Non Frozen\",ROUND(F35*0.75,0),0))","v":0},0,0,0,0,0,0,0,0,0,0,0]
["Section 6 - Payable Consumption"]
[14,"Annualization of consumption for new units",null,null,null,{"$f":"IF(F15=\"Flat Rate\",\"Flat Rate\",0)","v":0},0,0,0,0,0,0,0,0,0,0,0]
[15,"Payable consumption (Sum of Line 09, Line 12, Line 13, and Line 14)",null,null,null,{"$f":"IF(F15=\"Flat Rate\",\"Flat Rate\",(SUM(IF(ISNUMBER(F32),ROUND(F32,0),0),IF(ISNUMBER(F36),ROUND(F36,0)),0,IF(ISNUMBER(F37),ROUND(F37,0),0),IF(ISNUMBER(F39),ROUND(F39,0),0))))","v":0},{"$f":"IF(G15=\"Flat Rate\",\"Flat Rate\",(SUM(IF(ISNUMBER(G32),ROUND(G32,0),0),IF(ISNUMBER(G36),ROUND(G36,0)),0,IF(ISNUMBER(G37),ROUND(G37,0),0),IF(ISNUMBER(G39),ROUND(G39,0),0))))","v":0},{"$f":"IF(H15=\"Flat Rate\",\"Flat Rate\",(SUM(IF(ISNUMBER(H32),ROUND(H32,0),0),IF(ISNUMBER(H36),ROUND(H36,0)),0,IF(ISNUMBER(H37),ROUND(H37,0),0),IF(ISNUMBER(H39),ROUND(H39,0),0))))","v":0},0,0,0,0,0,0,0,0,0]
["Section 7 - Actual Utility Costs and Average Rate"]
[16,"Actual utility costs (12-month period 7/1/2013 to 6/30/2014)",null,null,null,0,0,0,0,0,0,0,0,0,0,0,0]
[17,"Actual average utility rate (Line 16 ¸ Line 01)",null,null,null,{"$f":"IF(F15=\"Flat Rate\",\"Flat Rate\",IF(ISERROR(F42/F20),0,ROUND(F42/F20,4)))","v":0},{"$f":"IF(G15=\"Flat Rate\",\"Flat Rate\",IF(ISERROR(G42/G20),0,ROUND(G42/G20,4)))","v":0},0,0,0,0,0,0,0,0,0,0]
["Section 8 - Base Utilities and Inflation/Deflation Factor"]
[18,"Base utilities expense level - whole dollars (Line 15 x Line 17)",null,null,null,{"$f":"IF(ISNUMBER(ROUND(F40*F43,0)),ROUND(F40*F43,0),ROUND(F42,0))","v":0},0,0,0,0,0,0,0,0,0,0,0,{"$f":"SUM(F45:Q45)","v":0}]
[19,"Surcharges for excess consumption of PHA-supplied utilities (12-month period 7/1/2013 to 6/30/2014) - whole dollars"]
[null,null,null,null,null,null,null,null,null,null,{"$f":"CONCATENATE(\"Operating Fund Project Number \",$D$13)","v":"Operating Fund Project Number Please Select PPN"},null,null,null,null,null,{"$f":"CONCATENATE(\"Operating Fund Project Number \",$D$13)","v":"Operating Fund Project Number Please Select PPN"}]
[20,"Base Utilities expense level minus surcharges (Line 18 minus Line 19)",null,null,null,null,null,null,null,null,null,null,null,null,null,null,null,{"$f":"R45-ROUND(R46,0)","v":0}]
[21,"Utilities inflation/deflation factor",null,null,null,null,null,null,null,null,null,null,null,null,null,null,null,1.0563]
["Section 9 - Calculation of Utilities Expense Level"]
[22,"Utilities expense level adjusted for inflation/deflation - whole dollars (Line 20 x Line 21)",null,null,null,null,null,null,null,null,null,null,null,null,null,null,null,{"$f":"ROUND(R48*R49,0)","v":0}]
[23,"Energy rate incentive"]
[24,"Utilities expense level - whole dollars (Line 22 + Line 23)",null,null,null,null,null,null,null,null,null,null,null,null,null,null,null,{"$f":"R51+ROUND(R52,0)","v":0}]
[25,"Eligible unit months (from the original form HUD-52723, Column B, Line 15 plus Line 17 minus Line 04)"]
[26,"Utilities Expense Level - PUM (Line 24 ¸ Line 25)",null,null,null,null,null,null,null,null,null,null,null,null,null,null,null,{"$f":"IF(ISERROR(R53/R54),0,ROUND(R53/R54,2))","v":0}]
["Section 10 - Remarks (provide section, part, and line numbers)"]
[""]

{"sheet":"Sheet2","index":2,"n_rows":65,"n_cols":52,"rows_kept":65,"cut":false,"hidden":false,"merged":[]}
["Flat Rate",1,"Coal",3,"Pounds",null,"Coal",{"$f":"MATCH(G1,$C$1:$C$71,0)","v":1},"UOC_COAL","Linked Cells",null,null,null,null,"Linked Cells for",null,null,null,null,null,null,null,null,null,null,null,null,"Row #","Line #"]
["Frozen",2,null,null,"Tons",null,"Electricity",5,"UOC_ELEC",{"$f":"OFFSET(IncentiveTypes,IncentiveType1-1,0,1,1)","v":"Non Frozen"},2,null,null,null,"Incentive Type",null,null,null,null,null,null,null,null,null,null,null,null,15,null,{"$f":"+P2","v":0},{"$f":"+Q2","v":0},0,0,0,0,0,0,0,0,0,0,null,null,null,null,null,null,null,null,null,{"$f":"+AK7","v":0},0]
["Non Frozen",3,null,null,"Other",null,"Fuel Oil",8,"UOC_FUELOIL",{"$f":"OFFSET(UtilityTypes,K3-1,0,1,1)","v":"Coal"},1,null,null,null,"Unit of Consumption",null,null,null,null,null,null,null,null,null,null,null,null,16,null,{"$f":"+P4","v":0},{"$f":"+Q4","v":0},0,0,0,0,0,0,0,0,0,0,null,null,null,null,null,null,null,null,null,{"$f":"+AK8","v":0},0]
[null,null,null,null,null,null,"Gas",11,"UOC_GAS",{"$f":"OFFSET(UOCS,RowOne+UnitOfConsump1-1,0,1,1)","v":"Pounds"},1,null,null,null,"Utility Type",null,null,null,null,null,null,null,null,null,null,null,null,20,"01",{"$f":"+'52722'!F20","v":0},{"$f":"+'52722'!G20","v":0},{"$f":"+'52722'!H20","v":0},{"$f":"+'52722'!I20","v":0},{"$f":"+'52722'!J20","v":0},{"$f":"+'52722'!K20","v":0},{"$f":"+'52722'!L20","v":0},{"$f":"+'52722'!M20","v":0},{"$f":"+'52722'!N20","v":0},{"$f":"+'52722'!O20","v":0},{"$f":"+'52722'!P20","v":0},{"$f":"+'52722'!Q20","v":0},null,null,null,null,null,null,null,null,null,{"$f":"+'52722'!#REF!","v":{"$error":"#REF!"}},{"$f":"+'52722'!#REF!","v":{"$error":"#REF!"}}]
[null,1,"Electricity",2,"Kilowatt Hours (KWH)",null,"Propane",17,"UOC_PROPANE",null,null,null,null,null,null,null,null,null,null,null,null,null,null,null,null,null,null,21,"01A",{"$f":"+P9","v":""},{"$f":"+Q9","v":""},"","","","","","","","","","",null,null,null,null,null,null,null,null,null,0,0]
[null,2,null,null,"Other",null,"Sewer (if reported separately)",20,"UOC_SEWER","RowOne",{"$f":"OFFSET($H$1,TypeOfUtility1-1,0)-1","v":0},null,null,null,{"$f":"+O4&\" Range\"","v":"Utility Type Range"},{"$f":"VLOOKUP(P4,$G$1:$I$11,3,FALSE)","v":{"$error":"#N/A"}},{"$error":"#N/A"},{"$error":"#N/A"},{"$f":"VLOOKUP(S4,$G$1:$I$11,3,FALSE)","v":{"$error":"#N/A"}},{"$error":"#N/A"},{"$error":"#N/A"},{"$error":"#N/A"},{"$error":"#N/A"},{"$error":"#N/A"},{"$error":"#N/A"},{"$error":"#N/A"},{"$error":"#N/A"},23,"02",{"$f":"+'52722'!F23","v":0},{"$f":"+'52722'!G23","v":0},{"$f":"+'52722'!H23","v":0},{"$f":"+'52722'!I23","v":0},{"$f":"+'52722'!J23","v":0},{"$f":"+'52722'!K23","v":0},{"$f":"+'52722'!L23","v":0},{"$f":"+'52722'!M23","v":0},{"$f":"+'52722'!N23","v":0},{"$f":"+'52722'!O23","v":0},{"$f":"+'52722'!P23","v":0},{"$f":"+'52722'!Q23","v":0},null,null,null,null,null,null,null,null,null,{"$f":"+'52722'!#REF!","v":{"$error":"#REF!"}},{"$f":"+'52722'!#REF!","v":{"$error":"#REF!"}}]
[null,null,null,null,null,null,"Water and Sewer (if combined)",28,"UOC_BOTH","RowTwo",{"$f":"OFFSET($H$1,TypeOfUtility1,0)","v":5},null,null,null,{"$f":"\"Text \" &O2","v":"Text Incentive Type"},{"$f":"IF(P2>0,OFFSET(DDHDR,P2-1,0,1,1),\"\")","v":""},"","",{"$error":"#N/A"},"","","","","","","","",24,"03",{"$f":"+'52722'!F24","v":0},{"$f":"+'52722'!G24","v":0},{"$f":"+'52722'!H24","v":0},{"$f":"+'52722'!I24","v":0},{"$f":"+'52722'!J24","v":0},{"$f":"+'52722'!K24","v":0},{"$f":"+'52722'!L24","v":0},{"$f":"+'52722'!M24","v":0},{"$f":"+'52722'!N24","v":0},{"$f":"+'52722'!O24","v":0},{"$f":"+'52722'!P24","v":0},{"$f":"+'52722'!Q24","v":0},null,null,null,null,null,null,null,null,null,{"$f":"+'52722'!#REF!","v":{"$error":"#REF!"}},{"$f":"+'52722'!#REF!","v":{"$error":"#REF!"}}]
[null,1,"Fuel Oil",2,"Gallons",null,"Water (if reported separately)",36,"UOC_WATER","HowManyRows",{"$f":"+RowTwo-RowOne-2","v":3},null,null,null,{"$f":"\"Text \" &O4","v":"Text Utility Type"},{"$f":"IF(P$4>0,OFFSET(UtilityTypes,P$4-1,0,1,1),\"\")","v":""},"","",{"$f":"VLOOKUP(S6,$G$1:$I$11,3,FALSE)","v":{"$error":"#N/A"}},"","","","","","","","",25,"04",{"$f":"+'52722'!F25","v":0},{"$f":"+'52722'!G25","v":0},{"$f":"+'52722'!H25","v":0},{"$f":"+'52722'!I25","v":0},{"$f":"+'52722'!J25","v":0},{"$f":"+'52722'!K25","v":0},{"$f":"+'52722'!L25","v":0},{"$f":"+'52722'!M25","v":0},{"$f":"+'52722'!N25","v":0},{"$f":"+'52722'!O25","v":0},{"$f":"+'52722'!P25","v":0},{"$f":"+'52722'!Q25","v":0},null,null,null,null,null,null,null,null,null,{"$f":"+'52722'!#REF!","v":{"$error":"#REF!"}},{"$f":"+'52722'!#REF!","v":{"$error":"#REF!"}}]
[null,2,null,null,"Other",null,"Wood",44,"UOC_WOOD",null,null,null,null,null,{"$f":"\"Text \" &O3","v":"Text Unit of Consumption"},{"$f":"IF(P3>0,OFFSET(INDIRECT(P6),P$3-1,0,1,1),\"\")","v":""},"","","","","","","","","","","",26,"05",{"$f":"+'52722'!F26","v":0},{"$f":"+'52722'!G26","v":0},{"$f":"+'52722'!H26","v":0},{"$f":"+'52722'!I26","v":0},{"$f":"+'52722'!J26","v":0},{"$f":"+'52722'!K26","v":0},{"$f":"+'52722'!L26","v":0},{"$f":"+'52722'!M26","v":0},{"$f":"+'52722'!N26","v":0},{"$f":"+'52722'!O26","v":0},{"$f":"+'52722'!P26","v":0},{"$f":"+'52722'!Q26","v":0},null,null,null,null,null,null,null,null,null,{"$f":"+'52722'!AA26","v":0},{"$f":"+'52722'!AB26","v":0}]
[null,null,null,null,null,null,"Steam",47,"UOC_STEAM",null,null,null,null,null,null,null,null,null,null,null,null,null,null,null,null,null,null,28,"06",{"$f":"+'52722'!F28","v":0},{"$f":"+'52722'!G28","v":0},{"$f":"+'52722'!H28","v":0},{"$f":"+'52722'!I28","v":0},{"$f":"+'52722'!J28","v":0},{"$f":"+'52722'!K28","v":0},{"$f":"+'52722'!L28","v":0},{"$f":"+'52722'!M28","v":0},{"$f":"+'52722'!N28","v":0},{"$f":"+'52722'!O28","v":0},{"$f":"+'52722'!P28","v":0},{"$f":"+'52722'!Q28","v":0},null,null,null,null,null,null,null,null,null,{"$f":"+'52722'!AA28","v":0},{"$f":"+'52722'!AB28","v":0}]
["Yes",1,"Gas",5,"Therms",null,"Other",52,"UOC_OTHER",null,null,null,null,null,null,null,null,null,null,null,null,null,null,null,null,null,null,29,"07",{"$f":"+'52722'!F29","v":0},{"$f":"+'52722'!G29","v":0},{"$f":"+'52722'!H29","v":0},{"$f":"+'52722'!I29","v":0},{"$f":"+'52722'!J29","v":0},{"$f":"+'52722'!K29","v":0},{"$f":"+'52722'!L29","v":0},{"$f":"+'52722'!M29","v":0},{"$f":"+'52722'!N29","v":0},{"$f":"+'52722'!O29","v":0},{"$f":"+'52722'!P29","v":0},{"$f":"+'52722'!Q29","v":0},null,null,null,null,null,null,null,null,null,{"$f":"+'52722'!AA29","v":0},{"$f":"+'52722'!AB29","v":0}]
["No",2,null,null,"Cubic Feet",null,"End",65,null,null,null,null,null,null,null,null,null,null,null,null,null,null,null,null,null,null,null,30,"08",{"$f":"+'52722'!F30","v":0},{"$f":"+'52722'!G30","v":0},{"$f":"+'52722'!H30","v":0},{"$f":"+'52722'!I30","v":0},{"$f":"+'52722'!J30","v":0},{"$f":"+'52722'!K30","v":0},{"$f":"+'52722'!L30","v":0},{"$f":"+'52722'!M30","v":0},{"$f":"+'52722'!N30","v":0},{"$f":"+'52722'!O30","v":0},{"$f":"+'52722'!P30","v":0},{"$f":"+'52722'!Q30","v":0},null,null,null,null,null,null,null,null,null,{"$f":"+'52722'!AA30","v":0},{"$f":"+'52722'!AB30","v":0}]
[null,3,null,null,"100 cubic feet  (CCF)",null,null,null,null,null,null,null,null,null,null,null,null,null,null,null,null,null,null,null,null,null,null,32,"09",{"$f":"+'52722'!F32","v":0},{"$f":"+'52722'!G32","v":0},{"$f":"+'52722'!H32","v":0},{"$f":"+'52722'!I32","v":0},{"$f":"+'52722'!J32","v":0},{"$f":"+'52722'!K32","v":0},{"$f":"+'52722'!L32","v":0},{"$f":"+'52722'!M32","v":0},{"$f":"+'52722'!N32","v":0},{"$f":"+'52722'!O32","v":0},{"$f":"+'52722'!P32","v":0},{"$f":"+'52722'!Q32","v":0},null,null,null,null,null,null,null,null,null,{"$f":"+'52722'!AA32","v":0},{"$f":"+'52722'!AB32","v":0}]
[null,4,null,null,"1000 cubic feet (MCF)",null,null,null,null,null,null,null,null,null,null,null,null,null,null,null,null,null,null,null,null,null,null,34,10,{"$f":"+'52722'!F34","v":0},{"$f":"+'52722'!G34","v":0},{"$f":"+'52722'!H34","v":0},{"$f":"+'52722'!I34","v":0},{"$f":"+'52722'!J34","v":0},{"$f":"+'52722'!K34","v":0},{"$f":"+'52722'!L34","v":0},{"$f":"+'52722'!M34","v":0},{"$f":"+'52722'!N34","v":0},{"$f":"+'52722'!O34","v":0},{"$f":"+'52722'!P34","v":0},{"$f":"+'52722'!Q34","v":0},null,null,null,null,null,null,null,null,null,{"$f":"+'52722'!AA34","v":0},{"$f":"+'52722'!AB34","v":0}]
[null,5,null,null,"Other",null,null,null,null,null,null,null,null,null,null,null,null,"Non Frozen",null,null,null,null,null,null,null,null,null,35,11,{"$f":"+'52722'!F35","v":0},{"$f":"+'52722'!G35","v":0},{"$f":"+'52722'!H35","v":0},{"$f":"+'52722'!I35","v":0},{"$f":"+'52722'!J35","v":0},{"$f":"+'52722'!K35","v":0},{"$f":"+'52722'!L35","v":0},{"$f":"+'52722'!M35","v":0},{"$f":"+'52722'!N35","v":0},{"$f":"+'52722'!O35","v":0},{"$f":"+'52722'!P35","v":0},{"$f":"+'52722'!Q35","v":0},null,null,null,null,null,null,null,null,null,{"$f":"+'52722'!AA35","v":0},{"$f":"+'52722'!AB35","v":0}]
[null,null,"test",null,null,null,null,null,null,null,null,null,null,null,null,null,null,null,null,null,null,null,null,null,null,null,null,36,12,{"$f":"+'52722'!F36","v":0},{"$f":"+'52722'!G36","v":0},{"$f":"+'52722'!H36","v":0},{"$f":"+'52722'!I36","v":0},{"$f":"+'52722'!J36","v":0},{"$f":"+'52722'!K36","v":0},{"$f":"+'52722'!L36","v":0},{"$f":"+'52722'!M36","v":0},{"$f":"+'52722'!N36","v":0},{"$f":"+'52722'!O36","v":0},{"$f":"+'52722'!P36","v":0},{"$f":"+'52722'!Q36","v":0},null,null,null,null,null,null,null,null,null,{"$f":"+'52722'!AA36","v":0},{"$f":"+'52722'!AB36","v":0}]
[null,1,"Propane",2,"Gallons",null,null,null,null,null,null,null,null,null,null,null,null,null,null,null,null,null,null,null,null,null,null,37,13,{"$f":"+'52722'!F37","v":0},{"$f":"+'52722'!G37","v":0},{"$f":"+'52722'!H37","v":0},{"$f":"+'52722'!I37","v":0},{"$f":"+'52722'!J37","v":0},{"$f":"+'52722'!K37","v":0},{"$f":"+'52722'!L37","v":0},{"$f":"+'52722'!M37","v":0},{"$f":"+'52722'!N37","v":0},{"$f":"+'52722'!O37","v":0},{"$f":"+'52722'!P37","v":0},{"$f":"+'52722'!Q37","v":0},null,null,null,null,null,null,null,null,null,{"$f":"+'52722'!AA37","v":0},{"$f":"+'52722'!AB37","v":0}]
[null,2,null,null,"Other",null,null,null,null,null,null,null,null,null,null,null,null,null,null,null,null,null,null,null,null,null,null,39,14,{"$f":"+'52722'!F39","v":0},{"$f":"+'52722'!G39","v":0},{"$f":"+'52722'!H39","v":0},{"$f":"+'52722'!I39","v":0},{"$f":"+'52722'!J39","v":0},{"$f":"+'52722'!K39","v":0},{"$f":"+'52722'!L39","v":0},{"$f":"+'52722'!M39","v":0},{"$f":"+'52722'!N39","v":0},{"$f":"+'52722'!O39","v":0},{"$f":"+'52722'!P39","v":0},{"$f":"+'52722'!Q39","v":0},null,null,null,null,null,null,null,null,null,{"$f":"+'52722'!AA39","v":0},{"$f":"+'52722'!AB39","v":0}]
[null,null,null,null,null,null,null,null,null,null,null,null,null,null,null,null,null,null,null,null,null,null,null,null,null,null,null,40,15,{"$f":"+'52722'!F40","v":0},{"$f":"+'52722'!G40","v":0},{"$f":"+'52722'!H40","v":0},{"$f":"+'52722'!I40","v":0},{"$f":"+'52722'!J40","v":0},{"$f":"+'52722'!K40","v":0},{"$f":"+'52722'!L40","v":0},{"$f":"+'52722'!M40","v":0},{"$f":"+'52722'!N40","v":0},{"$f":"+'52722'!O40","v":0},{"$f":"+'52722'!P40","v":0},{"$f":"+'52722'!Q40","v":0},null,null,null,null,null,null,null,null,null,{"$f":"+'52722'!AA40","v":0},{"$f":"+'52722'!AB40","v":0}]
[null,1,"Sewer (if reported separately)",7,"Gallons",null,{"$f":"MATCH('52722'!D13,'UEL Details'!$A:$A,0)","v":2},null,null,null,null,null,null,null,null,null,null,null,null,null,null,null,null,null,null,null,null,42,16,{"$f":"+'52722'!F42","v":0},{"$f":"+'52722'!G42","v":0},{"$f":"+'52722'!H42","v":0},{"$f":"+'52722'!I42","v":0},{"$f":"+'52722'!J42","v":0},{"$f":"+'52722'!K42","v":0},{"$f":"+'52722'!L42","v":0},{"$f":"+'52722'!M42","v":0},{"$f":"+'52722'!N42","v":0},{"$f":"+'52722'!O42","v":0},{"$f":"+'52722'!P42","v":0},{"$f":"+'52722'!Q42","v":0},null,null,null,null,null,null,null,null,null,{"$f":"+'52722'!AA42","v":0},{"$f":"+'52722'!AB42","v":0}]
[null,2,null,null,"100 Gallons (Cgal)",null,null,null,null,null,null,null,null,null,null,null,null,null,null,null,null,null,null,null,null,null,null,43,17,{"$f":"+'52722'!F43","v":0},{"$f":"+'52722'!G43","v":0},{"$f":"+'52722'!H43","v":0},{"$f":"+'52722'!I43","v":0},{"$f":"+'52722'!J43","v":0},{"$f":"+'52722'!K43","v":0},{"$f":"+'52722'!L43","v":0},{"$f":"+'52722'!M43","v":0},{"$f":"+'52722'!N43","v":0},{"$f":"+'52722'!O43","v":0},{"$f":"+'52722'!P43","v":0},{"$f":"+'52722'!Q43","v":0},null,null,null,null,null,null,null,null,null,{"$f":"+'52722'!AA43","v":0},{"$f":"+'52722'!AB43","v":0}]
[null,3,null,null,"1000 Gallons (Mgal)",null,{"$f":"MATCH('52722'!D13,'UEL Header'!$A:$A,0)","v":2},null,null,null,null,null,null,null,null,null,null,null,null,null,null,null,null,null,null,null,null,45,18,{"$f":"+'52722'!F45","v":0},{"$f":"+'52722'!G45","v":0},{"$f":"+'52722'!H45","v":0},{"$f":"+'52722'!I45","v":0},{"$f":"+'52722'!J45","v":0},{"$f":"+'52722'!K45","v":0},{"$f":"+'52722'!L45","v":0},{"$f":"+'52722'!M45","v":0},{"$f":"+'52722'!N45","v":0},{"$f":"+'52722'!O45","v":0},{"$f":"+'52722'!P45","v":0},{"$f":"+'52722'!Q45","v":0},null,null,null,null,null,null,null,null,null,{"$f":"+'52722'!AA45","v":0},{"$f":"+'52722'!AB45","v":0}]
[null,4,null,null,"Cubic feet",null,null,null,null,null,null,null,null,null,null,null,null,null,null,null,null,null,null,null,null,null,null,46,19,{"$f":"+'52722'!F46","v":0},{"$f":"+'52722'!G46","v":0},{"$f":"+'52722'!H46","v":0},{"$f":"+'52722'!I46","v":0},{"$f":"+'52722'!J46","v":0},{"$f":"+'52722'!K46","v":0},{"$f":"+'52722'!L46","v":0},{"$f":"+'52722'!M46","v":0},{"$f":"+'52722'!N46","v":0},{"$f":"+'52722'!O46","v":0},{"$f":"+'52722'!P46","v":0},{"$f":"+'52722'!Q46","v":0},null,null,null,null,null,null,null,null,null,{"$f":"+'52722'!AA46","v":0},{"$f":"+'52722'!AB46","v":0}]
[null,5,null,null,"100 cubic feet  (CCF)",null,null,null,null,null,null,null,null,null,null,null,null,null,null,null,null,null,null,null,null,null,null,48,20,{"$f":"+'52722'!F48","v":0},{"$f":"+'52722'!G48","v":0},{"$f":"+'52722'!H48","v":0},{"$f":"+'52722'!I48","v":0},{"$f":"+'52722'!J48","v":0},{"$f":"+'52722'!K48","v":0},{"$f":"+'52722'!L48","v":0},{"$f":"+'52722'!M48","v":0},{"$f":"+'52722'!N48","v":0},{"$f":"+'52722'!O48","v":0},{"$f":"+'52722'!P48","v":0},{"$f":"+'52722'!Q48","v":0},null,null,null,null,null,null,null,null,null,{"$f":"+'52722'!AA48","v":0},{"$f":"+'52722'!AB48","v":0}]
[null,6,null,null,"1000 cubic feet (MCF)",null,null,null,null,null,null,null,null,null,null,null,null,null,null,null,null,null,null,null,null,null,null,49,21,{"$f":"+'52722'!F49","v":0},{"$f":"+'52722'!G49","v":0},{"$f":"+'52722'!H49","v":0},{"$f":"+'52722'!I49","v":0},{"$f":"+'52722'!J49","v":0},{"$f":"+'52722'!K49","v":0},{"$f":"+'52722'!L49","v":0},{"$f":"+'52722'!M49","v":0},{"$f":"+'52722'!N49","v":0},{"$f":"+'52722'!O49","v":0},{"$f":"+'52722'!P49","v":0},{"$f":"+'52722'!Q49","v":0},null,null,null,null,null,null,null,null,null,{"$f":"+'52722'!AA49","v":0},{"$f":"+'52722'!AB49","v":0}]
[null,7,null,null,"Other",null,null,null,null,null,null,null,null,null,null,null,null,null,null,null,null,null,null,null,null,null,null,51,22,{"$f":"+'52722'!F51","v":0},{"$f":"+'52722'!G51","v":0},{"$f":"+'52722'!H51","v":0},{"$f":"+'52722'!I51","v":0},{"$f":"+'52722'!J51","v":0},{"$f":"+'52722'!K51","v":0},{"$f":"+'52722'!L51","v":0},{"$f":"+'52722'!M51","v":0},{"$f":"+'52722'!N51","v":0},{"$f":"+'52722'!O51","v":0},{"$f":"+'52722'!P51","v":0},{"$f":"+'52722'!Q51","v":0},null,null,null,null,null,null,null,null,null,{"$f":"+'52722'!AA51","v":0},{"$f":"+'52722'!AB51","v":0}]
[null,null,null,null,null,null,null,null,null,null,null,null,null,null,null,null,null,null,null,null,null,null,null,null,null,null,null,52,23,{"$f":"+'52722'!F52","v":0},{"$f":"+'52722'!G52","v":0},{"$f":"+'52722'!H52","v":0},{"$f":"+'52722'!I52","v":0},{"$f":"+'52722'!J52","v":0},{"$f":"+'52722'!K52","v":0},{"$f":"+'52722'!L52","v":0},{"$f":"+'52722'!M52","v":0},{"$f":"+'52722'!N52","v":0},{"$f":"+'52722'!O52","v":0},{"$f":"+'52722'!P52","v":0},{"$f":"+'52722'!Q52","v":0},null,null,null,null,null,null,null,null,null,{"$f":"+'52722'!AA52","v":0},{"$f":"+'52722'!AB52","v":0}]
[null,1,"Water and Sewer (if combined)",7,"Gallons",null,null,null,null,null,null,null,null,null,null,null,null,null,null,null,null,null,null,null,null,null,null,53,24,{"$f":"+'52722'!F53","v":0},{"$f":"+'52722'!G53","v":0},{"$f":"+'52722'!H53","v":0},{"$f":"+'52722'!I53","v":0},{"$f":"+'52722'!J53","v":0},{"$f":"+'52722'!K53","v":0},{"$f":"+'52722'!L53","v":0},{"$f":"+'52722'!M53","v":0},{"$f":"+'52722'!N53","v":0},{"$f":"+'52722'!O53","v":0},{"$f":"+'52722'!P53","v":0},{"$f":"+'52722'!Q53","v":0},null,null,null,null,null,null,null,null,null,{"$f":"+'52722'!AA53","v":0},{"$f":"+'52722'!AB53","v":0}]
[null,2,null,null,"100 Gallons (Cgal)",null,null,null,null,null,null,null,null,null,null,null,null,null,null,null,null,null,null,null,null,null,null,54,25,{"$f":"+'52722'!F54","v":0},{"$f":"+'52722'!G54","v":0},{"$f":"+'52722'!H54","v":0},{"$f":"+'52722'!I54","v":0},{"$f":"+'52722'!J54","v":0},{"$f":"+'52722'!K54","v":0},{"$f":"+'52722'!L54","v":0},{"$f":"+'52722'!M54","v":0},{"$f":"+'52722'!N54","v":0},{"$f":"+'52722'!O54","v":0},{"$f":"+'52722'!P54","v":0},{"$f":"+'52722'!Q54","v":0},null,null,null,null,null,null,null,null,null,{"$f":"+'52722'!AA54","v":0},{"$f":"+'52722'!AB54","v":0}]
[null,3,null,null,"1000 Gallons (Mgal)",null,null,null,null,null,null,null,null,null,null,null,null,null,null,null,null,null,null,null,null,null,null,55,26,{"$f":"+'52722'!F55","v":0},{"$f":"+'52722'!G55","v":0},{"$f":"+'52722'!H55","v":0},{"$f":"+'52722'!I55","v":0},{"$f":"+'52722'!J55","v":0},{"$f":"+'52722'!K55","v":0},{"$f":"+'52722'!L55","v":0},{"$f":"+'52722'!M55","v":0},{"$f":"+'52722'!N55","v":0},{"$f":"+'52722'!O55","v":0},{"$f":"+'52722'!P55","v":0},{"$f":"+'52722'!Q55","v":0},null,null,null,null,null,null,null,null,null,{"$f":"+'52722'!AA55","v":0},{"$f":"+'52722'!AB55","v":0}]
[null,4,null,null,"Cubic feet"]
[null,5,null,null,"100 cubic feet  (CCF)"]
[null,6,null,null,"1000 cubic feet (MCF)"]
[null,7,null,null,"Other"]
[]
[null,1,"Water (if reported separately)",7,"Gallons"]
[null,2,null,null,"100 Gallons (Cgal)"]
[null,3,null,null,"1000 Gallons (Mgal)"]
[null,4,null,null,"Cubic feet"]
[null,5,null,null,"100 cubic feet  (CCF)"]
[null,6,null,null,"1000 cubic feet (MCF)"]
[null,7,null,null,"Other"]
[]
[null,1,"Wood",2,"Tons"]
[null,2,null,null,"Other"]
[]
[null,1,"Steam",4,"Pounds"]
[null,null,null,null,"Therms"]
[null,null,null,null,"BTU"]
[null,null,null,null,"Other"]
[]
[null,1,"Other",12,"100 cubic feet  (CCF)"]
[null,2,null,null,"100 Gallons (Cgal)"]
[null,3,null,null,"1000 cubic feet (MCF)"]
[null,4,null,null,"1000 Gallons (Mgal)"]
[null,5,null,null,"BTU"]
[null,6,null,null,"Cubic feet"]
[null,7,null,null,"Gallons"]
[null,8,null,null,"Kilowatt Hours (kWh)"]
[null,9,null,null,"Pounds"]
[null,10,null,null,"Therms"]
[null,11,null,null,"Tons"]
[null,12,null,null,"Other"]
[]
[null,null,"End",null,"End"]

{"sheet":"UEL Header","index":3,"n_rows":18,"n_cols":21,"rows_kept":18,"cut":false,"hidden":false,"merged":[]}
["PPN","HAName","ACC","DUNS","ROFO","FYE","UnitChangeInd","RRIYN","StudyYear","BaseUtilityExpenseLevel","UtilitySurcharges","BaseMinusSurcharge","UtiliyInflationDeflationFactor","UELAdjustedForInflation","EnergyRateIncentive","UEL","EligibleUnitMonths","FinalUEL","addr1","addr2","comments"]
["Please Select PPN",null,null,null,null,null,false,false]
[]
[]
[]
[]
[]
[]
[]
[]
[]
[]
[]
[]
[]
[]
[]
[null,null,null,null,null,null,null,null,null,null,null,null,null,null,null,null,null,null,null,null,""]

{"sheet":"UEL Details","index":4,"n_rows":13,"n_cols":23,"rows_kept":13,"cut":false,"hidden":false,"merged":[]}
["PPN","FundingYear","UtilityCategory","UtilityType","ActualConsumption","UnitOfConsumption","ActualConsumptionYear-1","ActualConsumptionYear-2","ActualConsumptionYear-3","ActualConsumptionTotal","ActualConsumptionAvg","ActualConsumptionNewUnits","RollingBaseConsumption","BaseConsumptionMinusCalculated","CalculatedLine10","CalculatedLine11","CalculatedLine12","CalculatedLine13","AnnualizedComsumptionNewUnits","CalculatedLine15","ActualUtilityCosts","CalculatedLine17","CalculatedLine18"]
["Please Select PPN"]
["Please Select PPN"]
["Please Select PPN"]
["Please Select PPN"]
["Please Select PPN"]
["Please Select PPN"]
["Please Select PPN"]
["Please Select PPN"]
["Please Select PPN"]
["Please Select PPN"]
["Please Select PPN"]
["Please Select PPN"]

{"sheet":"Blank","index":5,"n_rows":0,"n_cols":0,"rows_kept":0,"cut":false,"hidden":false,"merged":[]}

{"sheet":"Reference","index":6,"n_rows":3144,"n_cols":60,"rows_kept":3144,"cut":false,"hidden":false,"merged":[]}
[null,null,null,null,null,null,null,null,null,null,null,null,null,null,"NP.22.1.0",null,null,null,null,null,null,null,null,null,null,null,null,null,"LatestVersion>>>","Version 22.NP.1.0",null,null,null,null,null,null,null,null,null,null,null,null,null,null,null,null,null,null,null,null,null,null,"PPN","HAName"]
["State","PHAs","State","PHAs","State",null,null,null,"Funding Period","01/01/2015-12/31/2015",null,null,null,null,null,null,"AL004",null,null,null,null,null,null,null,null,"State",null,null,null,null,"Done","Started","Open",null,null,null,null,null,null,null,null,null,null,null,null,null,null,null,null,null,null,null,"Please Select PPN",null,null,null,null,null,"PHA"]
["AK",null,"AK",{"$f":"COUNTIF($E$3:$E$4000,A3)","v":0},{"$f":"LEFT(F3,2)","v":"AL"},"AL005",{"$f":"VLOOKUP(F3,$AY3:$BB$50,4,FALSE)","v":"Phoenix City HA"},null,null,null,null,null,null,null,null,null,"AL004",null,null,null,null,null,null,null,"AL006","AK",null,null,null,null,"2012-04-01",null,null,null,null,null,null,null,null,null,null,null,null,null,null,null,null,null,null,null,"AL005","AL005000018","@AL005000018","Phoenix City HA",null,null,null,null,"AL005",{"$f":"VLOOKUP(BG3,$AY3:$BB$50,4,FALSE)","v":"Phoenix City HA"}]
["AL",null,"AL",{"$f":"COUNTIF($E$3:$E$4000,A4)","v":2},"AL","AL190",{"$f":"VLOOKUP(F4,$AY4:$BB$50,4,FALSE)","v":"Housing Authority of Greene County, Al"},null,null,"Starting","Ending",null,null,null,null,null,"AL004",null,null,null,null,"AK001","Yes",null,null,"AL",null,null,null,null,null,"Used latest 52723 PHA tool as a starting point",null,null,null,null,null,null,null,null,null,null,null,null,null,null,null,null,null,null,"AL190","AL190000004","@AL190000004","Housing Authority of Greene County, Al",null,null,null,null,"AL190",{"$f":"VLOOKUP(BG4,$AY4:$BB$50,4,FALSE)","v":"Housing Authority of Greene County, Al"}]
["AR",null,"AR",0,"FL","FL003",{"$f":"VLOOKUP(F5,$AY5:$BB$50,4,FALSE)","v":"Tampa Housing Authority"},null,"AMP","al001",{"$f":"+_LC2","v":{"$error":"#NAME?"}},null,null,null,null,null,"AL004",null,null,null,null,"AL001","No",null,null,"AR",null,null,null,null,null,"Replaced Excel /Data/Filter/Advanced with vba to generate PHA list",null,null,null,null,null,null,null,null,null,null,null,null,null,null,null,null,null,null,"FL003","FL003000043","@FL003000043","Tampa Housing Authority",null,null,null,null,"FL003",{"$f":"VLOOKUP(BG5,$AY5:$BB$50,4,FALSE)","v":"Tampa Housing Authority"}]
["AZ",null,"AZ",0,"FL","FL005",{"$f":"VLOOKUP(F6,$AY6:$BB$50,4,FALSE)","v":"Miami Dade Housing"},null,"Row",{"$error":"#NAME?"},{"$f":"IF(LEN(_AMP2)=5,MATCH(_AMP2,PHAS,0)+2,MATCH(_AMP2,DDAMP,0)+2)","v":{"$error":"#NAME?"}},{"$f":"MATCH(_LC3,#REF!,0)+2","v":{"$error":"#NAME?"}},null,null,null,null,"AL004",null,null,null,null,"AL002","No",null,null,"AZ",null,null,null,null,null,"Redefined object references to reflect header/details (for UEL) vs 1 sheet for 23 form  ",null,null,null,null,null,null,null,null,null,null,null,null,null,null,null,null,null,null,"FL005","FL005000848","@FL005000848","Miami Dade Housing",null,null,null,null,"FL005",{"$f":"VLOOKUP(BG6,$AY6:$BB$50,4,FALSE)","v":"Miami Dade Housing"}]
["CA",null,"CA",0,"FL","FL021",{"$f":"VLOOKUP(F7,$AY7:$BB$50,4,FALSE)","v":"Pahokee Housing Authority"},null,"Count",{"$error":"#NAME?"},{"$f":"IF(LEN(_AMP2)=5,COUNTIF(PHAS,_AMP2),0)","v":{"$error":"#NAME?"}},null,null,null,null,null,"AL004",null,null,null,null,"AL004","No",null,null,"CA",null,null,null,null,null,"Code executes properly for web based up thru actually selecting a pha and transferring data to prepop sheets",null,null,null,null,null,null,null,null,null,null,null,null,null,null,null,null,null,null,"FL005","FL005000849","@FL005000849","Miami Dade Housing",null,null,null,null,"FL021",{"$f":"VLOOKUP(BG7,$AY7:$BB$50,4,FALSE)","v":"Pahokee Housing Authority"}]
["CO",null,"CO",0,"FL","FL062",{"$f":"VLOOKUP(F8,$AY8:$BB$50,4,FALSE)","v":"Pinellas County Housing Authority"},null,"Cell Locations","AK001","WY015",null,null,null,null,null,"AL004",null,null,null,null,"AL005","No",null,null,"CO",null,null,null,null,null,"Added 'latestversion' to 22 form A4",null,null,null,null,null,null,null,null,null,null,null,null,null,null,null,null,null,null,"FL005","FL005000850","@FL005000850","Miami Dade Housing",null,null,null,null,"FL062",{"$f":"VLOOKUP(BG8,$AY8:$BB$50,4,FALSE)","v":"Pinellas County Housing Authority"}]
["CT",null,"CT",0,"IN","IN003",{"$f":"VLOOKUP(F9,$AY9:$BB$50,4,FALSE)","v":"Fort Wayne "},null,null,null,null,null,null,null,null,null,"AL004",null,null,null,null,"AL006","No",null,null,"CT",null,null,null,null,null,null,null,null,null,null,null,null,null,null,null,null,null,null,null,null,null,null,null,null,"FL005","FL005000851","@FL005000851","Miami Dade Housing",null,null,null,null,"IN003",{"$f":"VLOOKUP(BG9,$AY9:$BB$50,4,FALSE)","v":"Fort Wayne "}]
["DC",null,"DC",0,"LA","LA004",{"$f":"VLOOKUP(F10,$AY10:$BB$50,4,FALSE)","v":"Housing Authority of Lake Charles"},null,null,null,null,null,null,null,null,null,"AL004",null,null,null,null,"AL007","No",null,null,"DC",null,null,null,"Version 22.NP.1.0","1/10/1015","Changed latest 2015 Main Tool v. 2.04 into New Project Tool - MJC",null,null,null,null,null,null,null,null,null,null,null,null,null,null,null,null,null,null,"FL005","FL005000852","@FL005000852","Miami Dade Housing",null,null,null,null,"LA004",{"$f":"VLOOKUP(BG10,$AY10:$BB$50,4,FALSE)","v":"Housing Authority of Lake Charles"}]
["DE",null,"DE",0,"MI","MI001",{"$f":"VLOOKUP(F11,$AY11:$BB$50,4,FALSE)","v":"Detroit Housing Commission"},null,null,null,null,null,null,null,null,null,null,null,null,null,null,"AL008","No",null,null,"DE",null,null,null,null,null,null,null,null,null,null,null,null,null,null,null,null,null,null,null,null,null,null,null,null,"FL021","FL021000004","@FL021000004","Pahokee Housing Authority",null,null,null,null,"MI001",{"$f":"VLOOKUP(BG11,$AY11:$BB$50,4,FALSE)","v":"Detroit Housing Commission"}]
["FL",null,"FL",4,"MN","MN003",{"$f":"VLOOKUP(F12,$AY12:$BB$50,4,FALSE)","v":"HRA of Duluth"},null,null,null,null,null,null,null,null,null,null,null,null,null,null,"AL009","No",null,null,"FL",null,null,null,null,null,null,null,null,null,null,null,null,null,null,null,null,null,null,null,null,null,null,null,null,"FL062","FL062000011","@FL062000011","Pinellas County Housing Authority",null,null,null,null,"MN003",{"$f":"VLOOKUP(BG12,$AY12:$BB$50,4,FALSE)","v":"HRA of Duluth"}]
["GA",null,"GA",0,"MO","MO009",{"$f":"VLOOKUP(F13,$AY13:$BB$50,4,FALSE)","v":"City of Jefferson City"},null,null,null,null,null,null,null,null,null,null,null,null,null,null,"AL010","No",null,null,"GA",null,null,null,null,null,null,null,null,null,null,null,null,null,null,null,null,null,null,null,null,null,null,null,null,"IN003","IN003000008","@IN003000008","Fort Wayne ",null,null,null,null,"MO009",{"$f":"VLOOKUP(BG13,$AY13:$BB$50,4,FALSE)","v":"City of Jefferson City"}]
["GQ",null,"GQ",0,"MS","MS004",{"$f":"VLOOKUP(F14,$AY14:$BB$50,4,FALSE)","v":"Meridian HA"},null,null,null,null,null,null,null,null,null,null,null,null,null,null,"AL011","No",null,null,"GQ",null,null,null,null,null,null,null,null,null,null,null,null,null,null,null,null,null,null,null,null,null,null,null,null,"LA004","LA004000006","@LA004000006","Housing Authority of Lake Charles",null,null,null,null,"MS004",{"$f":"VLOOKUP(BG14,$AY14:$BB$50,4,FALSE)","v":"Meridian HA"}]
["HI",null,"HI",0,"MS","MS103",{"$f":"VLOOKUP(F15,$AY15:$BB$50,4,FALSE)","v":"Jackson Housing Authority"},null,null,null,null,null,null,null,null,null,null,null,null,null,null,"AL012","No",null,null,"HI",null,null,null,null,null,null,null,null,null,null,null,null,null,null,null,null,null,null,null,null,null,null,null,null,"MI001","MI001000081","@MI001000081","Detroit Housing Commission",null,null,null,null,"MS103",{"$f":"VLOOKUP(BG15,$AY15:$BB$50,4,FALSE)","v":"Jackson Housing Authority"}]
["IA",null,"IA",0,"NC","NC003",{"$f":"VLOOKUP(F16,$AY16:$BB$50,4,FALSE)","v":"Charlotte HA"},null,null,null,null,null,null,null,null,null,null,null,null,null,null,"AL013","No",null,null,"IA",null,null,null,null,null,null,null,null,null,null,null,null,null,null,null,null,null,null,null,null,null,null,null,null,"MN003","MN003000014","@MN003000014","HRA of Duluth",null,null,null,null,"NC003",{"$f":"VLOOKUP(BG16,$AY16:$BB$50,4,FALSE)","v":"Charlotte HA"}]
["ID",null,"ID",0,"NC","NC009",{"$f":"VLOOKUP(F17,$AY17:$BB$50,4,FALSE)","v":"Fayetteville Metropolitan Housing Authority"},null,null,null,null,null,null,null,null,null,null,null,null,null,null,"AL014","No",null,null,"ID",null,null,null,null,null,null,null,null,null,null,null,null,null,null,null,null,null,null,null,null,null,null,null,null,"MO009","MO009000002","@MO009000002","City of Jefferson City",null,null,null,null,"NC009",{"$f":"VLOOKUP(BG17,$AY17:$BB$50,4,FALSE)","v":"Fayetteville Metropolitan Housing Authority"}]
["IL",null,"IL",0,"NC","NC012",{"$f":"VLOOKUP(F18,$AY18:$BB$50,4,FALSE)","v":"Housing Authority of the City Winston-Salem"},null,null,null,null,null,null,null,null,null,null,null,null,null,null,"AL047","No",null,null,"IL",null,null,null,null,null,null,null,null,null,null,null,null,null,null,null,null,null,null,null,null,null,null,null,null,"MS004","MS004000021","@MS004000021","Meridian HA",null,null,null,null,"NC012",{"$f":"VLOOKUP(BG18,$AY18:$BB$50,4,FALSE)","v":"Housing Authority of the City Winston-Salem"}]
["IN",null,"IN",1,"NJ","NJ008",{"$f":"VLOOKUP(F19,$AY19:$BB$50,4,FALSE)","v":"Long Branch Housing Authority"},null,null,null,null,null,null,null,null,null,null,null,null,null,null,"AL048","No",null,null,"IN",null,null,null,null,null,null,null,null,null,null,null,null,null,null,null,null,null,null,null,null,null,null,null,null,"MS103","MS103000003","@MS103000003","Jackson Housing Authority",null,null,null,null,"NJ008",{"$f":"VLOOKUP(BG19,$AY19:$BB$50,4,FALSE)","v":"Long Branch Housing Authority"}]
["KS",null,"KS",0,"NJ","NJ021",{"$f":"VLOOKUP(F20,$AY20:$BB$50,4,FALSE)","v":"Paterson Housing Authority"},null,null,null,null,null,null,null,null,null,null,null,null,null,null,"AL049","No",null,null,"KS",null,null,null,null,null,null,null,null,null,null,null,null,null,null,null,null,null,null,null,null,null,null,null,null,"NC003","NC003000063","@NC003000063","Charlotte HA",null,null,null,null,"NJ021",{"$f":"VLOOKUP(BG20,$AY20:$BB$50,4,FALSE)","v":"Paterson Housing Authority"}]
["KY",null,"KY",0,"OH","OH003",{"$f":"VLOOKUP(F21,$AY21:$BB$50,4,FALSE)","v":"Cuyahoga MHA"},null,null,null,null,null,null,null,null,null,null,null,null,null,null,"AL050","No",null,null,"KY",null,null,null,null,null,null,null,null,null,null,null,null,null,null,null,null,null,null,null,null,null,null,null,null,"NC003","NC003000064","@NC003000064","Charlotte",null,null,null,null,"OH003",{"$f":"VLOOKUP(BG21,$AY21:$BB$50,4,FALSE)","v":"Cuyahoga MHA"}]
["LA",null,"LA",1,"OH","OH005",{"$f":"VLOOKUP(F22,$AY22:$BB$50,4,FALSE)","v":"Dayton MHA"},null,null,null,null,null,null,null,null,null,null,null,null,null,null,"AL051","No",null,null,"LA",null,null,null,null,null,null,null,null,null,null,null,null,null,null,null,null,null,null,null,null,null,null,null,null,"NC003","NC003000065","@NC003000065","Charlotte",null,null,null,null,"OH005",{"$f":"VLOOKUP(BG22,$AY22:$BB$50,4,FALSE)","v":"Dayton MHA"}]
["MA",null,"MA",0,"OH","OH008",{"$f":"VLOOKUP(F23,$AY23:$BB$50,4,FALSE)","v":"Trumbull MHA"},null,null,null,null,null,null,null,null,null,null,null,null,null,null,"AL052","No",null,null,"MA",null,null,null,null,null,null,null,null,null,null,null,null,null,null,null,null,null,null,null,null,null,null,null,null,"NC009","NC009000024","@NC009000024","Fayetteville Metropolitan Housing Authority",null,null,null,null,"OH008",{"$f":"VLOOKUP(BG23,$AY23:$BB$50,4,FALSE)","v":"Trumbull MHA"}]
["MD",null,"MD",0,"RI","RI005",{"$f":"VLOOKUP(F24,$AY24:$BB$50,4,FALSE)","v":"Newport HA"},null,null,null,null,null,null,null,null,null,null,null,null,null,null,"AL053","No",null,null,"MD",null,null,null,null,null,null,null,null,null,null,null,null,null,null,null,null,null,null,null,null,null,null,null,null,"NC012","NC012000037","@NC012000037","Housing Authority of the City Winston-Salem",null,null,null,null,"RI005",{"$f":"VLOOKUP(BG24,$AY24:$BB$50,4,FALSE)","v":"Newport HA"}]
["ME",null,"ME",0,"TN","TN001",{"$f":"VLOOKUP(F25,$AY25:$BB$50,4,FALSE)","v":"MEMPHIS HOUSING AUTHORITY"},null,null,null,null,null,null,null,null,null,null,null,null,null,null,"AL054","Yes",null,null,"ME",null,null,null,null,null,null,null,null,null,null,null,null,null,null,null,null,null,null,null,null,null,null,null,null,"NJ008","NJ008000015","@NJ008000015","Long Branch Housing Authority",null,null,null,null,"TN001",{"$f":"VLOOKUP(BG25,$AY25:$BB$50,4,FALSE)","v":"MEMPHIS HOUSING AUTHORITY"}]
["MI",null,"MI",1,"TX","TX006",{"$f":"VLOOKUP(F26,$AY26:$BB$50,4,FALSE)","v":"San Antonio"},null,null,null,null,null,null,null,null,null,null,null,null,null,null,"AL055","No",null,null,"MI",null,null,null,null,null,null,null,null,null,null,null,null,null,null,null,null,null,null,null,null,null,null,null,null,"NJ008","NJ008000017","@NJ008000017","Long Branch Housing Authority",null,null,null,null,"TX006",{"$f":"VLOOKUP(BG26,$AY26:$BB$50,4,FALSE)","v":"San Antonio"}]
["MN",null,"MN",1,"TX","TX065",{"$f":"VLOOKUP(F27,$AY27:$BB$50,4,FALSE)","v":"Harlingen Housing authority"},null,null,null,null,null,null,null,null,null,null,null,null,null,null,"AL056","No",null,null,"MN",null,null,null,null,null,null,null,null,null,null,null,null,null,null,null,null,null,null,null,null,null,null,null,null,"NJ008","NJ008000018","@NJ008000018","Long Branch Housing Authority",null,null,null,null,"TX065",{"$f":"VLOOKUP(BG27,$AY27:$BB$50,4,FALSE)","v":"Harlingen Housing authority"}]
["MO",null,"MO",1,"VA","VA007",{"$f":"VLOOKUP(F28,$AY28:$BB$50,4,FALSE)","v":"Richmond Redevelopment and Housing Authority"},null,null,null,null,null,null,null,null,null,null,null,null,null,null,"AL057","No",null,null,"MO",null,null,null,null,null,null,null,null,null,null,null,null,null,null,null,null,null,null,null,null,null,null,null,null,"NJ021","NJ021000021","@NJ021000021","Paterson Housing Authority",null,null,null,null,"VA007",{"$f":"VLOOKUP(BG28,$AY28:$BB$50,4,FALSE)","v":"Richmond Redevelopment and Housing Authority"}]
["MS",null,"MS",2,"WI","WI021",{"$f":"VLOOKUP(F29,$AY29:$BB$50,4,FALSE)","v":"Brillion Hsg Auth"},null,null,null,null,null,null,null,null,null,null,null,null,null,null,"AL058","No",null,null,"MS",null,null,null,null,null,null,null,null,null,null,null,null,null,null,null,null,null,null,null,null,null,null,null,null,"OH003","OH003000128","@OH003000128","Cuyahoga MHA",null,null,null,null,"WI021",{"$f":"VLOOKUP(BG29,$AY29:$BB$50,4,FALSE)","v":"Brillion Hsg Auth"}]
["MT",null,"MT",0,"WI","WI031",{"$f":"VLOOKUP(F30,$AY30:$BB$50,4,FALSE)","v":"Wausau HA"},null,null,null,null,null,null,null,null,null,null,null,null,null,null,"AL059","No",null,null,"MT",null,null,null,null,null,null,null,null,null,null,null,null,null,null,null,null,null,null,null,null,null,null,null,null,"OH003","OH003000129","@OH003000129","Cuyahoga MHA",null,null,null,null,"WI031",{"$f":"VLOOKUP(BG30,$AY30:$BB$50,4,FALSE)","v":"Wausau HA"}]
["NC",null,"NC",3,"WI","WI064",{"$f":"VLOOKUP(F31,$AY31:$BB$50,4,FALSE)","v":"Beloit Hsg Auth"},null,null,null,null,null,null,null,null,null,null,null,null,null,null,"AL060","No",null,null,"NC",null,null,null,null,null,null,null,null,null,null,null,null,null,null,null,null,null,null,null,null,null,null,null,null,"OH003","OH003000131","@OH003000131","Cuyahoga MHA",null,null,null,null,"WI064",{"$f":"VLOOKUP(BG31,$AY31:$BB$50,4,FALSE)","v":"Beloit Hsg Auth"}]
["ND",null,"ND",0,"WI","WI065",{"$f":"VLOOKUP(F32,$AY32:$BB$50,4,FALSE)","v":"Appleton Hsg Auth"},null,null,null,null,null,null,null,null,null,null,null,null,null,null,"AL061","No",null,null,"ND",null,null,null,null,null,null,null,null,null,null,null,null,null,null,null,null,null,null,null,null,null,null,null,null,"OH003","OH003000132","@OH003000132","Cuyahoga MHA",null,null,null,null,"WI065",{"$f":"VLOOKUP(BG32,$AY32:$BB$50,4,FALSE)","v":"Appleton Hsg Auth"}]
["NE",null,"NE",0,"WI","WI113",{"$f":"VLOOKUP(F33,$AY33:$BB$50,4,FALSE)","v":"Housing Authority of the City of Oshkosh, Wi"},null,null,null,null,null,null,null,null,null,null,null,null,null,null,"AL062","No",null,null,"NE",null,null,null,null,null,null,null,null,null,null,null,null,null,null,null,null,null,null,null,null,null,null,null,null,"OH003","OH003000932","@OH003000932","Cuyahoga MHA",null,null,null,null,"WI113",{"$f":"VLOOKUP(BG33,$AY33:$BB$50,4,FALSE)","v":"Housing Authority of the City of Oshkosh, Wi"}]
["NH",null,"NH",0,{"$f":"LEFT(F34,2)","v":""},null,null,null,null,null,null,null,null,null,null,null,null,null,null,null,null,"AL063","No",null,null,"NH",null,null,null,null,null,null,null,null,null,null,null,null,null,null,null,null,null,null,null,null,null,null,null,null,"OH005","OH005000014","@OH005000014","Dayton MHA",null,null,null,null,null,{"$f":"VLOOKUP(BG34,$AY34:$BB$50,4,FALSE)","v":{"$error":"#N/A"}}]
["NJ",null,"NJ",2,"",null,null,null,null,null,null,null,null,null,null,null,null,null,null,null,null,"AL064","No",null,null,"NJ",null,null,null,null,null,null,null,null,null,null,null,null,null,null,null,null,null,null,null,null,null,null,null,null,"OH008","OH008021000","@OH008021000","Trumbull MHA",null,null,null,null,null,{"$f":"VLOOKUP(BG35,$AY35:$BB$50,4,FALSE)","v":{"$error":"#N/A"}}]
["NM",null,"NM",0,"",null,null,null,null,null,null,null,null,null,null,null,null,null,null,null,null,"AL065","No",null,null,"NM",null,null,null,null,null,null,null,null,null,null,null,null,null,null,null,null,null,null,null,null,null,null,null,null,"RI005","RI005000013","@RI005000013","Newport HA",null,null,null,null,null,{"$f":"VLOOKUP(BG36,$AY36:$BB$50,4,FALSE)","v":{"$error":"#N/A"}}]
["NV",null,"NV",0,"",null,null,null,null,null,null,null,null,null,null,null,null,null,null,null,null,"AL066","No",null,null,"NV",null,null,null,null,null,null,null,null,null,null,null,null,null,null,null,null,null,null,null,null,null,null,null,null,"TN001","TN001000072","@TN001000072","MEMPHIS HOUSING AUTHORITY",null,null,null,null,null,{"$f":"VLOOKUP(BG37,$AY37:$BB$50,4,FALSE)","v":{"$error":"#N/A"}}]
["NY",null,"NY",0,"",null,null,null,null,null,null,null,null,null,null,null,null,null,null,null,null,"AL067","No",null,null,"NY",null,null,null,null,null,null,null,null,null,null,null,null,null,null,null,null,null,null,null,null,null,null,null,null,"TX006","TX006000056","@TX006000056","San Antonio",null,null,null,null,null,{"$f":"VLOOKUP(BG38,$AY38:$BB$50,4,FALSE)","v":{"$error":"#N/A"}}]
["OH",null,"OH",3,"",null,null,null,null,null,null,null,null,null,null,null,null,null,null,null,null,"AL068","No",null,null,"OH",null,null,null,null,null,null,null,null,null,null,null,null,null,null,null,null,null,null,null,null,null,null,null,null,"TX065","TX065000050","@TX065000050","Harlingen Housing authority",null,null,null,null,null,{"$f":"VLOOKUP(BG39,$AY39:$BB$50,4,FALSE)","v":{"$error":"#N/A"}}]
["OK",null,"OK",0,"",null,null,null,null,null,null,null,null,null,null,null,null,null,null,null,null,"AL069","No",null,null,"OK",null,null,null,null,null,null,null,null,null,null,null,null,null,null,null,null,null,null,null,null,null,null,null,null,"VA007","VA007000017","@VA007000017","Richmond Redevelopment and Housing Authority",null,null,null,null,null,{"$f":"VLOOKUP(BG40,$AY40:$BB$50,4,FALSE)","v":{"$error":"#N/A"}}]
["OR",null,"OR",0,"",null,null,null,null,null,null,null,null,null,null,null,null,null,null,null,null,"AL070","No",null,null,"OR",null,null,null,null,null,null,null,null,null,null,null,null,null,null,null,null,null,null,null,null,null,null,null,null,"VA007","VA007000036","@VA007000036","Richmond Redevelopment and Housing Authority",null,null,null,null,null,{"$f":"VLOOKUP(BG41,$AY41:$BB$50,4,FALSE)","v":{"$error":"#N/A"}}]
["PA",null,"PA",0,"",null,null,null,null,null,null,null,null,null,null,null,null,null,null,null,null,"AL071","No",null,null,"PA",null,null,null,null,null,null,null,null,null,null,null,null,null,null,null,null,null,null,null,null,null,null,null,null,"WI021","WI021000002","@WI021000002","Brillion Hsg Auth",null,null,null,null,null,{"$f":"VLOOKUP(BG42,$AY42:$BB$50,4,FALSE)","v":{"$error":"#N/A"}}]
["RI",null,"RI",1,"",null,null,null,null,null,null,null,null,null,null,null,null,null,null,null,null,"AL072","No",null,null,"RI",null,null,null,null,null,null,null,null,null,null,null,null,null,null,null,null,null,null,null,null,null,null,null,null,"WI031","WI031000003","@WI031000003","Wausau HA",null,null,null,null,null,{"$f":"VLOOKUP(BG43,$AY43:$BB$50,4,FALSE)","v":{"$error":"#N/A"}}]
["RQ",null,"RQ",0,"",null,null,null,null,null,null,null,null,null,null,null,null,null,null,null,null,"AL073","No",null,null,"RQ",null,null,null,null,null,null,null,null,null,null,null,null,null,null,null,null,null,null,null,null,null,null,null,null,"WI064","WI064000005","@WI064000005","Beloit Hsg Auth",null,null,null,null,null,{"$f":"VLOOKUP(BG44,$AY44:$BB$50,4,FALSE)","v":{"$error":"#N/A"}}]
["SC",null,"SC",0,"",null,null,null,null,null,null,null,null,null,null,null,null,null,null,null,null,"AL074","No",null,null,"SC",null,null,null,null,null,null,null,null,null,null,null,null,null,null,null,null,null,null,null,null,null,null,null,null,"WI064","WI064000006","@WI064000006","Beloit Hsg Auth",null,null,null,null,null,{"$f":"VLOOKUP(BG45,$AY45:$BB$50,4,FALSE)","v":{"$error":"#N/A"}}]
["SD",null,"SD",0,"",null,null,null,null,null,null,null,null,null,null,null,null,null,null,null,null,"AL075","No",null,null,"SD",null,null,null,null,null,null,null,null,null,null,null,null,null,null,null,null,null,null,null,null,null,null,null,null,"WI064","WI064000007","@WI064000007","Beloit Hsg Auth",null,null,null,null,null,{"$f":"VLOOKUP(BG46,$AY46:$BB$50,4,FALSE)","v":{"$error":"#N/A"}}]
["TN",null,"TN",1,"",null,null,null,null,null,null,null,null,null,null,null,null,null,null,null,null,"AL076","No",null,null,"TN",null,null,null,null,null,null,null,null,null,null,null,null,null,null,null,null,null,null,null,null,null,null,null,null,"WI065","WI065000016","@WI065000016","Appleton Hsg Auth",null,null,null,null,null,{"$f":"VLOOKUP(BG47,$AY47:$BB$50,4,FALSE)","v":{"$error":"#N/A"}}]
["TX",null,"TX",2,"",null,null,null,null,null,null,null,null,null,null,null,null,null,null,null,null,"AL077","No",null,null,"TX",null,null,null,null,null,null,null,null,null,null,null,null,null,null,null,null,null,null,null,null,null,null,null,null,"WI065","WI065000017","@WI065000017","Appleton Hsg Auth",null,null,null,null,null,{"$f":"VLOOKUP(BG48,$AY48:$BB$50,4,FALSE)","v":{"$error":"#N/A"}}]
["UT",null,"UT",0,"",null,null,null,null,null,null,null,null,null,null,null,null,null,null,null,null,"AL078","No",null,null,"UT",null,null,null,null,null,null,null,null,null,null,null,null,null,null,null,null,null,null,null,null,null,null,null,null,"WI113","WI113000006","@WI113000006","Housing Authority of the City of Oshkosh, Wi",null,null,null,null,null,{"$f":"VLOOKUP(BG49,$AY49:$BB$50,4,FALSE)","v":{"$error":"#N/A"}}]
["VA",null,"VA",1,"",null,null,null,null,null,null,null,null,null,null,null,null,null,null,null,null,"AL079","No",null,null,"VA",null,null,null,null,null,null,null,null,null,null,null,null,null,null,null,null,null,null,null,null,null,null,null,null,"WI113","WI113000007","@WI113000007","Oshkosh Housing Auth",null,null,null,null,null,{"$f":"VLOOKUP(BG50,$AY50:$BB$50,4,FALSE)","v":{"$error":"#N/A"}}]
["VQ",null,"VQ",0,"",null,null,null,null,null,null,null,null,null,null,null,null,null,null,null,null,"AL080","No",null,null,"VQ"]
["VT",null,"VT",0,"",null,null,null,null,null,null,null,null,null,null,null,null,null,null,null,null,"AL081","No",null,null,"VT"]
["WA",null,"WA",0,"",null,null,null,null,null,null,null,null,null,null,null,null,null,null,null,null,"AL082","No",null,null,"WA"]
["WI",null,"WI",5,"",null,null,null,null,null,null,null,null,null,null,null,null,null,null,null,null,"AL083","No",null,null,"WI"]
["WV",null,"WV",0,"",null,null,null,null,null,null,null,null,null,null,null,null,null,null,null,null,"AL084","No",null,null,"WV"]
["WY",null,"WY",0,"",null,null,null,null,null,null,null,null,null,null,null,null,null,null,null,null,"AL085","No",null,null,"WY"]
[null,null,null,null,"",null,null,null,null,null,null,null,null,null,null,null,null,null,null,null,null,"AL086","No"]
[null,null,null,null,"",null,null,null,null,null,null,null,null,null,null,null,null,null,null,null,null,"AL087","No"]
[null,null,null,null,"",null,null,null,null,null,null,null,null,null,null,null,null,null,null,null,null,"AL088","No"]
[null,null,null,null,"",null,null,null,null,null,null,null,null,null,null,null,null,null,null,null,null,"AL089","No"]
[null,null,null,null,"",null,null,null,null,null,null,null,null,null,null,null,null,null,null,null,null,"AL090","No"]
[null,null,null,null,"",null,null,null,null,null,null,null,null,null,null,null,null,null,null,null,null,"AL091","No"]
[null,null,null,null,"",null,null,null,null,null,null,null,null,null,null,null,null,null,null,null,null,"AL093","No"]
[null,null,null,null,"",null,null,null,null,null,null,null,null,null,null,null,null,null,null,null,null,"AL094","No"]
[null,null,null,null,"",null,null,null,null,null,null,null,null,null,null,null,null,null,null,null,null,"AL095","No"]
[null,null,null,null,"",null,null,null,null,null,null,null,null,null,null,null,null,null,null,null,null,"AL096","No"]
[null,null,null,null,{"$f":"LEFT(F67,2)","v":""},null,null,null,null,null,null,null,null,null,null,null,null,null,null,null,null,"AL098","No"]
[null,null,null,null,"",null,null,null,null,null,null,null,null,null,null,null,null,null,null,null,null,"AL099","No"]
[null,null,null,null,"",null,null,null,null,null,null,null,null,null,null,null,null,null,null,null,null,"AL100","No"]
[null,null,null,null,"",null,null,null,null,null,null,null,null,null,null,null,null,null,null,null,null,"AL101","No"]
[null,null,null,null,"",null,null,null,null,null,null,null,null,null,null,null,null,null,null,null,null,"AL102","No"]
[null,null,null,null,"",null,null,null,null,null,null,null,null,null,null,null,null,null,null,null,null,"AL103","No"]
[null,null,null,null,"",null,null,null,null,null,null,null,null,null,null,null,null,null,null,null,null,"AL104","No"]
[null,null,null,null,"",null,null,null,null,null,null,null,null,null,null,null,null,null,null,null,null,"AL105","No"]
[null,null,null,null,"",null,null,null,null,null,null,null,null,null,null,null,null,null,null,null,null,"AL106","No"]
[null,null,null,null,"",null,null,null,null,null,null,null,null,null,null,null,null,null,null,null,null,"AL107","No"]
[null,null,null,null,"",null,null,null,null,null,null,null,null,null,null,null,null,null,null,null,null,"AL108","No"]
[null,null,null,null,"",null,null,null,null,null,null,null,null,null,null,null,null,null,null,null,null,"AL109","No"]
[null,null,null,null,"",null,null,null,null,null,null,null,null,null,null,null,null,null,null,null,null,"AL110","No"]
[null,null,null,null,"",null,null,null,null,null,null,null,null,null,null,null,null,null,null,null,null,"AL111","No"]
[null,null,null,null,"",null,null,null,null,null,null,null,null,null,null,null,null,null,null,null,null,"AL112","No"]
[null,null,null,null,"",null,null,null,null,null,null,null,null,null,null,null,null,null,null,null,null,"AL114","No"]
[null,null,null,null,"",null,null,null,null,null,null,null,null,null,null,null,null,null,null,null,null,"AL115","No"]
[null,null,null,null,"",null,null,null,null,null,null,null,null,null,null,null,null,null,null,null,null,"AL116","No"]
[null,null,null,null,"",null,null,null,null,null,null,null,null,null,null,null,null,null,null,null,null,"AL117","No"]
[null,null,null,null,"",null,null,null,null,null,null,null,null,null,null,null,null,null,null,null,null,"AL118","No"]
[null,null,null,null,"",null,null,null,null,null,null,null,null,null,null,null,null,null,null,null,null,"AL119","No"]
[null,null,null,null,"",null,null,null,null,null,null,null,null,null,null,null,null,null,null,null,null,"AL120","No"]
[null,null,null,null,"",null,null,null,null,null,null,null,null,null,null,null,null,null,null,null,null,"AL121","No"]
[null,null,null,null,"",null,null,null,null,null,null,null,null,null,null,null,null,null,null,null,null,"AL122","No"]
[null,null,null,null,"",null,null,null,null,null,null,null,null,null,null,null,null,null,null,null,null,"AL123","No"]
[null,null,null,null,"",null,null,null,null,null,null,null,null,null,null,null,null,null,null,null,null,"AL124","No"]
[null,null,null,null,"",null,null,null,null,null,null,null,null,null,null,null,null,null,null,null,null,"AL125","No"]
[null,null,null,null,"",null,null,null,null,null,null,null,null,null,null,null,null,null,null,null,null,"AL126","No"]
[null,null,null,null,"",null,null,null,null,null,null,null,null,null,null,null,null,null,null,null,null,"AL127","No"]
[null,null,null,null,"",null,null,null,null,null,null,null,null,null,null,null,null,null,null,null,null,"AL128","No"]
[null,null,null,null,"",null,null,null,null,null,null,null,null,null,null,null,null,null,null,null,null,"AL129","No"]
[null,null,null,null,"",null,null,null,null,null,null,null,null,null,null,null,null,null,null,null,null,"AL131","No"]
[null,null,null,null,"",null,null,null,null,null,null,null,null,null,null,null,null,null,null,null,null,"AL132","No"]
[null,null,null,null,"",null,null,null,null,null,null,null,null,null,null,null,null,null,null,null,null,"AL133","No"]
[null,null,null,null,"",null,null,null,null,null,null,null,null,null,null,null,null,null,null,null,null,"AL134","No"]
[null,null,null,null,"",null,null,null,null,null,null,null,null,null,null,null,null,null,null,null,null,"AL135","No"]
[null,null,null,null,"",null,null,null,null,null,null,null,null,null,null,null,null,null,null,null,null,"AL136","No"]
[null,null,null,null,"",null,null,null,null,null,null,null,null,null,null,null,null,null,null,null,null,"AL137","No"]
[null,null,null,null,"",null,null,null,null,null,null,null,null,null,null,null,null,null,null,null,null,"AL138","No"]
[null,null,null,null,"",null,null,null,null,null,null,null,null,null,null,null,null,null,null,null,null,"AL139","No"]
[null,null,null,null,"",null,null,null,null,null,null,null,null,null,null,null,null,null,null,null,null,"AL140","No"]
[null,null,null,null,"",null,null,null,null,null,null,null,null,null,null,null,null,null,null,null,null,"AL141","No"]
[null,null,null,null,"",null,null,null,null,null,null,null,null,null,null,null,null,null,null,null,null,"AL142","No"]
[null,null,null,null,"",null,null,null,null,null,null,null,null,null,null,null,null,null,null,null,null,"AL143","No"]
[null,null,null,null,"",null,null,null,null,null,null,null,null,null,null,null,null,null,null,null,null,"AL144","No"]
[null,null,null,null,"",null,null,null,null,null,null,null,null,null,null,null,null,null,null,null,null,"AL145","No"]
[null,null,null,null,"",null,null,null,null,null,null,null,null,null,null,null,null,null,null,null,null,"AL146","No"]
[null,null,null,null,"",null,null,null,null,null,null,null,null,null,null,null,null,null,null,null,null,"AL147","No"]
[null,null,null,null,"",null,null,null,null,null,null,null,null,null,null,null,null,null,null,null,null,"AL149","No"]
[null,null,null,null,"",null,null,null,null,null,null,null,null,null,null,null,null,null,null,null,null,"AL150","No"]
[null,null,null,null,"",null,null,null,null,null,null,null,null,null,null,null,null,null,null,null,null,"AL151","No"]
[null,null,null,null,"",null,null,null,null,null,null,null,null,null,null,null,null,null,null,null,null,"AL152","No"]
[null,null,null,null,"",null,null,null,null,null,null,null,null,null,null,null,null,null,null,null,null,"AL153","No"]
[null,null,null,null,"",null,null,null,null,null,null,null,null,null,null,null,null,null,null,null,null,"AL154","No"]
[null,null,null,null,"",null,null,null,null,null,null,null,null,null,null,null,null,null,null,null,null,"AL155","No"]
[null,null,null,null,"",null,null,null,null,null,null,null,null,null,null,null,null,null,null,null,null,"AL156","No"]
[null,null,null,null,"",null,null,null,null,null,null,null,null,null,null,null,null,null,null,null,null,"AL157","No"]
[null,null,null,null,"",null,null,null,null,null,null,null,null,null,null,null,null,null,null,null,null,"AL158","No"]
[null,null,null,null,"",null,null,null,null,null,null,null,null,null,null,null,null,null,null,null,null,"AL159","No"]
[null,null,null,null,"",null,null,null,null,null,null,null,null,null,null,null,null,null,null,null,null,"AL160","No"]
[null,null,null,null,"",null,null,null,null,null,null,null,null,null,null,null,null,null,null,null,null,"AL161","No"]
[null,null,null,null,"",null,null,null,null,null,null,null,null,null,null,null,null,null,null,null,null,"AL164","No"]
[null,null,null,null,"",null,null,null,null,null,null,null,null,null,null,null,null,null,null,null,null,"AL165","No"]
[null,null,null,null,"",null,null,null,null,null,null,null,null,null,null,null,null,null,null,null,null,"AL166","No"]
[null,null,null,null,{"$f":"LEFT(F131,2)","v":""},null,null,null,null,null,null,null,null,null,null,null,null,null,null,null,null,"AL167","No"]
[null,null,null,null,"",null,null,null,null,null,null,null,null,null,null,null,null,null,null,null,null,"AL168","No"]
[null,null,null,null,"",null,null,null,null,null,null,null,null,null,null,null,null,null,null,null,null,"AL169","No"]
[null,null,null,null,"",null,null,null,null,null,null,null,null,null,null,null,null,null,null,null,null,"AL171","No"]
[null,null,null,null,"",null,null,null,null,null,null,null,null,null,null,null,null,null,null,null,null,"AL172","No"]
[null,null,null,null,"",null,null,null,null,null,null,null,null,null,null,null,null,null,null,null,null,"AL173","No"]
[null,null,null,null,"",null,null,null,null,null,null,null,null,null,null,null,null,null,null,null,null,"AL174","No"]
[null,null,null,null,"",null,null,null,null,null,null,null,null,null,null,null,null,null,null,null,null,"AL175","No"]
[null,null,null,null,"",null,null,null,null,null,null,null,null,null,null,null,null,null,null,null,null,"AL176","No"]
[null,null,null,null,"",null,null,null,null,null,null,null,null,null,null,null,null,null,null,null,null,"AL177","No"]
[null,null,null,null,"",null,null,null,null,null,null,null,null,null,null,null,null,null,null,null,null,"AL178","No"]
[null,null,null,null,"",null,null,null,null,null,null,null,null,null,null,null,null,null,null,null,null,"AL179","No"]
[null,null,null,null,"",null,null,null,null,null,null,null,null,null,null,null,null,null,null,null,null,"AL181","No"]
[null,null,null,null,"",null,null,null,null,null,null,null,null,null,null,null,null,null,null,null,null,"AL182","No"]
[null,null,null,null,"",null,null,null,null,null,null,null,null,null,null,null,null,null,null,null,null,"AL187","No"]
[null,null,null,null,"",null,null,null,null,null,null,null,null,null,null,null,null,null,null,null,null,"AL189","No"]
[null,null,null,null,"",null,null,null,null,null,null,null,null,null,null,null,null,null,null,null,null,"AL190","No"]
[null,null,null,null,"",null,null,null,null,null,null,null,null,null,null,null,null,null,null,null,null,"AL192","No"]
[null,null,null,null,"",null,null,null,null,null,null,null,null,null,null,null,null,null,null,null,null,"AL193","No"]
[null,null,null,null,"",null,null,null,null,null,null,null,null,null,null,null,null,null,null,null,null,"AL199","No"]
[null,null,null,null,"",null,null,null,null,null,null,null,null,null,null,null,null,null,null,null,null,"AL202","No"]
[null,null,null,null,"",null,null,null,null,null,null,null,null,null,null,null,null,null,null,null,null,"AR002","Yes"]
[null,null,null,null,"",null,null,null,null,null,null,null,null,null,null,null,null,null,null,null,null,"AR003","No"]
[null,null,null,null,"",null,null,null,null,null,null,null,null,null,null,null,null,null,null,null,null,"AR004","No"]
[null,null,null,null,"",null,null,null,null,null,null,null,null,null,null,null,null,null,null,null,null,"AR005","No"]
[null,null,null,null,"",null,null,null,null,null,null,null,null,null,null,null,null,null,null,null,null,"AR006","No"]
[null,null,null,null,"",null,null,null,null,null,null,null,null,null,null,null,null,null,null,null,null,"AR010","No"]
[null,null,null,null,"",null,null,null,null,null,null,null,null,null,null,null,null,null,null,null,null,"AR012","No"]
[null,null,null,null,"",null,null,null,null,null,null,null,null,null,null,null,null,null,null,null,null,"AR015","No"]
[null,null,null,null,"",null,null,null,null,null,null,null,null,null,null,null,null,null,null,null,null,"AR016","No"]
[null,null,null,null,"",null,null,null,null,null,null,null,null,null,null,null,null,null,null,null,null,"AR017","No"]
[null,null,null,null,"",null,null,null,null,null,null,null,null,null,null,null,null,null,null,null,null,"AR018","No"]
[null,null,null,null,"",null,null,null,null,null,null,null,null,null,null,null,null,null,null,null,null,"AR020","No"]
[null,null,null,null,"",null,null,null,null,null,null,null,null,null,null,null,null,null,null,null,null,"AR021","No"]
[null,null,null,null,"",null,null,null,null,null,null,null,null,null,null,null,null,null,null,null,null,"AR022","No"]
[null,null,null,null,"",null,null,null,null,null,null,null,null,null,null,null,null,null,null,null,null,"AR023","No"]
[null,null,null,null,"",null,null,null,null,null,null,null,null,null,null,null,null,null,null,null,null,"AR024","No"]
[null,null,null,null,"",null,null,null,null,null,null,null,null,null,null,null,null,null,null,null,null,"AR025","No"]
[null,null,null,null,"",null,null,null,null,null,null,null,null,null,null,null,null,null,null,null,null,"AR026","No"]
[null,null,null,null,"",null,null,null,null,null,null,null,null,null,null,null,null,null,null,null,null,"AR027","No"]
[null,null,null,null,"",null,null,null,null,null,null,null,null,null,null,null,null,null,null,null,null,"AR028","No"]
[null,null,null,null,"",null,null,null,null,null,null,null,null,null,null,null,null,null,null,null,null,"AR029","No"]
[null,null,null,null,"",null,null,null,null,null,null,null,null,null,null,null,null,null,null,null,null,"AR031","No"]
[null,null,null,null,"",null,null,null,null,null,null,null,null,null,null,null,null,null,null,null,null,"AR032","No"]
[null,null,null,null,"",null,null,null,null,null,null,null,null,null,null,null,null,null,null,null,null,"AR034","No"]
[null,null,null,null,"",null,null,null,null,null,null,null,null,null,null,null,null,null,null,null,null,"AR035","No"]
[null,null,null,null,"",null,null,null,null,null,null,null,null,null,null,null,null,null,null,null,null,"AR037","No"]
[null,null,null,null,"",null,null,null,null,null,null,null,null,null,null,null,null,null,null,null,null,"AR038","No"]
[null,null,null,null,"",null,null,null,null,null,null,null,null,null,null,null,null,null,null,null,null,"AR039","No"]
[null,null,null,null,"",null,null,null,null,null,null,null,null,null,null,null,null,null,null,null,null,"AR040","No"]
[null,null,null,null,"",null,null,null,null,null,null,null,null,null,null,null,null,null,null,null,null,"AR041","No"]
[null,null,null,null,"",null,null,null,null,null,null,null,null,null,null,null,null,null,null,null,null,"AR042","No"]
[null,null,null,null,"",null,null,null,null,null,null,null,null,null,null,null,null,null,null,null,null,"AR043","No"]
[null,null,null,null,"",null,null,null,null,null,null,null,null,null,null,null,null,null,null,null,null,"AR044","No"]
[null,null,null,null,"",null,null,null,null,null,null,null,null,null,null,null,null,null,null,null,null,"AR045","No"]
[null,null,null,null,"",null,null,null,null,null,null,null,null,null,null,null,null,null,null,null,null,"AR046","No"]
[null,null,null,null,"",null,null,null,null,null,null,null,null,null,null,null,null,null,null,null,null,"AR047","No"]
[null,null,null,null,"",null,null,null,null,null,null,null,null,null,null,null,null,null,null,null,null,"AR048","No"]
[null,null,null,null,"",null,null,null,null,null,null,null,null,null,null,null,null,null,null,null,null,"AR049","No"]
[null,null,null,null,"",null,null,null,null,null,null,null,null,null,null,null,null,null,null,null,null,"AR050","No"]
[null,null,null,null,"",null,null,null,null,null,null,null,null,null,null,null,null,null,null,null,null,"AR051","No"]
[null,null,null,null,"",null,null,null,null,null,null,null,null,null,null,null,null,null,null,null,null,"AR052","No"]
[null,null,null,null,"",null,null,null,null,null,null,null,null,null,null,null,null,null,null,null,null,"AR053","No"]
[null,null,null,null,"",null,null,null,null,null,null,null,null,null,null,null,null,null,null,null,null,"AR054","No"]
[null,null,null,null,{"$f":"LEFT(F195,2)","v":""},null,null,null,null,null,null,null,null,null,null,null,null,null,null,null,null,"AR055","No"]
[null,null,null,null,"",null,null,null,null,null,null,null,null,null,null,null,null,null,null,null,null,"AR057","No"]
[null,null,null,null,"",null,null,null,null,null,null,null,null,null,null,null,null,null,null,null,null,"AR058","No"]
[null,null,null,null,"",null,null,null,null,null,null,null,null,null,null,null,null,null,null,null,null,"AR059","No"]
[null,null,null,null,"",null,null,null,null,null,null,null,null,null,null,null,null,null,null,null,null,"AR060","No"]
[null,null,null,null,"",null,null,null,null,null,null,null,null,null,null,null,null,null,null,null,null,"AR061","No"]
[null,null,null,null,"",null,null,null,null,null,null,null,null,null,null,null,null,null,null,null,null,"AR063","No"]
[null,null,null,null,"",null,null,null,null,null,null,null,null,null,null,null,null,null,null,null,null,"AR064","No"]
[null,null,null,null,"",null,null,null,null,null,null,null,null,null,null,null,null,null,null,null,null,"AR065","No"]
[null,null,null,null,"",null,null,null,null,null,null,null,null,null,null,null,null,null,null,null,null,"AR066","No"]
[null,null,null,null,"",null,null,null,null,null,null,null,null,null,null,null,null,null,null,null,null,"AR068","No"]
[null,null,null,null,"",null,null,null,null,null,null,null,null,null,null,null,null,null,null,null,null,"AR069","No"]
[null,null,null,null,"",null,null,null,null,null,null,null,null,null,null,null,null,null,null,null,null,"AR070","No"]
[null,null,null,null,"",null,null,null,null,null,null,null,null,null,null,null,null,null,null,null,null,"AR071","No"]
[null,null,null,null,"",null,null,null,null,null,null,null,null,null,null,null,null,null,null,null,null,"AR072","No"]
[null,null,null,null,"",null,null,null,null,null,null,null,null,null,null,null,null,null,null,null,null,"AR073","No"]
[null,null,null,null,"",null,null,null,null,null,null,null,null,null,null,null,null,null,null,null,null,"AR074","No"]
[null,null,null,null,"",null,null,null,null,null,null,null,null,null,null,null,null,null,null,null,null,"AR075","No"]
[null,null,null,null,"",null,null,null,null,null,null,null,null,null,null,null,null,null,null,null,null,"AR076","No"]
[null,null,null,null,"",null,null,null,null,null,null,null,null,null,null,null,null,null,null,null,null,"AR078","No"]
[null,null,null,null,"",null,null,null,null,null,null,null,null,null,null,null,null,null,null,null,null,"AR079","No"]
[null,null,null,null,"",null,null,null,null,null,null,null,null,null,null,null,null,null,null,null,null,"AR080","No"]
[null,null,null,null,"",null,null,null,null,null,null,null,null,null,null,null,null,null,null,null,null,"AR081","No"]
[null,null,null,null,"",null,null,null,null,null,null,null,null,null,null,null,null,null,null,null,null,"AR082","No"]
[null,null,null,null,"",null,null,null,null,null,null,null,null,null,null,null,null,null,null,null,null,"AR083","No"]
[null,null,null,null,"",null,null,null,null,null,null,null,null,null,null,null,null,null,null,null,null,"AR084","No"]
[null,null,null,null,"",null,null,null,null,null,null,null,null,null,null,null,null,null,null,null,null,"AR085","No"]
[null,null,null,null,"",null,null,null,null,null,null,null,null,null,null,null,null,null,null,null,null,"AR086","No"]
[null,null,null,null,"",null,null,null,null,null,null,null,null,null,null,null,null,null,null,null,null,"AR087","No"]
[null,null,null,null,"",null,null,null,null,null,null,null,null,null,null,null,null,null,null,null,null,"AR088","No"]
[null,null,null,null,"",null,null,null,null,null,null,null,null,null,null,null,null,null,null,null,null,"AR089","No"]
[null,null,null,null,"",null,null,null,null,null,null,null,null,null,null,null,null,null,null,null,null,"AR090","No"]
[null,null,null,null,"",null,null,null,null,null,null,null,null,null,null,null,null,null,null,null,null,"AR091","No"]
[null,null,null,null,"",null,null,null,null,null,null,null,null,null,null,null,null,null,null,null,null,"AR092","No"]
[null,null,null,null,"",null,null,null,null,null,null,null,null,null,null,null,null,null,null,null,null,"AR093","No"]
[null,null,null,null,"",null,null,null,null,null,null,null,null,null,null,null,null,null,null,null,null,"AR094","No"]
[null,null,null,null,"",null,null,null,null,null,null,null,null,null,null,null,null,null,null,null,null,"AR095","No"]
[null,null,null,null,"",null,null,null,null,null,null,null,null,null,null,null,null,null,null,null,null,"AR096","No"]
[null,null,null,null,"",null,null,null,null,null,null,null,null,null,null,null,null,null,null,null,null,"AR097","No"]
[null,null,null,null,"",null,null,null,null,null,null,null,null,null,null,null,null,null,null,null,null,"AR098","No"]
[null,null,null,null,"",null,null,null,null,null,null,null,null,null,null,null,null,null,null,null,null,"AR099","No"]
[null,null,null,null,"",null,null,null,null,null,null,null,null,null,null,null,null,null,null,null,null,"AR101","No"]
[null,null,null,null,"",null,null,null,null,null,null,null,null,null,null,null,null,null,null,null,null,"AR102","No"]
[null,null,null,null,"",null,null,null,null,null,null,null,null,null,null,null,null,null,null,null,null,"AR103","No"]
[null,null,null,null,"",null,null,null,null,null,null,null,null,null,null,null,null,null,null,null,null,"AR104","No"]
[null,null,null,null,"",null,null,null,null,null,null,null,null,null,null,null,null,null,null,null,null,"AR106","No"]
[null,null,null,null,"",null,null,null,null,null,null,null,null,null,null,null,null,null,null,null,null,"AR111","No"]
[null,null,null,null,"",null,null,null,null,null,null,null,null,null,null,null,null,null,null,null,null,"AR112","No"]
[null,null,null,null,"",null,null,null,null,null,null,null,null,null,null,null,null,null,null,null,null,"AR113","No"]
[null,null,null,null,"",null,null,null,null,null,null,null,null,null,null,null,null,null,null,null,null,"AR117","No"]
[null,null,null,null,"",null,null,null,null,null,null,null,null,null,null,null,null,null,null,null,null,"AR118","No"]
[null,null,null,null,"",null,null,null,null,null,null,null,null,null,null,null,null,null,null,null,null,"AR121","No"]
[null,null,null,null,"",null,null,null,null,null,null,null,null,null,null,null,null,null,null,null,null,"AR122","No"]
[null,null,null,null,"",null,null,null,null,null,null,null,null,null,null,null,null,null,null,null,null,"AR123","No"]
[null,null,null,null,"",null,null,null,null,null,null,null,null,null,null,null,null,null,null,null,null,"AR131","No"]
[null,null,null,null,"",null,null,null,null,null,null,null,null,null,null,null,null,null,null,null,null,"AR141","No"]
[null,null,null,null,"",null,null,null,null,null,null,null,null,null,null,null,null,null,null,null,null,"AR146","No"]
[null,null,null,null,"",null,null,null,null,null,null,null,null,null,null,null,null,null,null,null,null,"AR148","No"]
[null,null,null,null,"",null,null,null,null,null,null,null,null,null,null,null,null,null,null,null,null,"AR170","No"]
[null,null,null,null,"",null,null,null,null,null,null,null,null,null,null,null,null,null,null,null,null,"AR171","No"]
[null,null,null,null,"",null,null,null,null,null,null,null,null,null,null,null,null,null,null,null,null,"AR172","No"]
[null,null,null,null,"",null,null,null,null,null,null,null,null,null,null,null,null,null,null,null,null,"AR175","No"]
[null,null,null,null,"",null,null,null,null,null,null,null,null,null,null,null,null,null,null,null,null,"AR197","No"]
[null,null,null,null,"",null,null,null,null,null,null,null,null,null,null,null,null,null,null,null,null,"AZ001","No"]
[null,null,null,null,{"$f":"LEFT(F259,2)","v":""},null,null,null,null,null,null,null,null,null,null,null,null,null,null,null,null,"AZ003","Yes"]
[null,null,null,null,"",null,null,null,null,null,null,null,null,null,null,null,null,null,null,null,null,"AZ004","No"]
[null,null,null,null,"",null,null,null,null,null,null,null,null,null,null,null,null,null,null,null,null,"AZ006","Yes"]
[null,null,null,null,"",null,null,null,null,null,null,null,null,null,null,null,null,null,null,null,null,"AZ008","No"]
[null,null,null,null,"",null,null,null,null,null,null,null,null,null,null,null,null,null,null,null,null,"AZ009","No"]
[null,null,null,null,"",null,null,null,null,null,null,null,null,null,null,null,null,null,null,null,null,"AZ010","No"]
[null,null,null,null,"",null,null,null,null,null,null,null,null,null,null,null,null,null,null,null,null,"AZ013","No"]
[null,null,null,null,"",null,null,null,null,null,null,null,null,null,null,null,null,null,null,null,null,"AZ021","No"]
[null,null,null,null,"",null,null,null,null,null,null,null,null,null,null,null,null,null,null,null,null,"AZ023","No"]
[null,null,null,null,"",null,null,null,null,null,null,null,null,null,null,null,null,null,null,null,null,"AZ025","No"]
[null,null,null,null,"",null,null,null,null,null,null,null,null,null,null,null,null,null,null,null,null,"AZ028","No"]
[null,null,null,null,"",null,null,null,null,null,null,null,null,null,null,null,null,null,null,null,null,"AZ035","No"]
[null,null,null,null,"",null,null,null,null,null,null,null,null,null,null,null,null,null,null,null,null,"AZ038","No"]
[null,null,null,null,"",null,null,null,null,null,null,null,null,null,null,null,null,null,null,null,null,"AZ041","No"]
[null,null,null,null,"",null,null,null,null,null,null,null,null,null,null,null,null,null,null,null,null,"CA001","No"]
[null,null,null,null,"",null,null,null,null,null,null,null,null,null,null,null,null,null,null,null,null,"CA002","No"]
[null,null,null,null,"",null,null,null,null,null,null,null,null,null,null,null,null,null,null,null,null,"CA003","No"]
[null,null,null,null,"",null,null,null,null,null,null,null,null,null,null,null,null,null,null,null,null,"CA004","Yes"]
[null,null,null,null,"",null,null,null,null,null,null,null,null,null,null,null,null,null,null,null,null,"CA005","No"]
[null,null,null,null,"",null,null,null,null,null,null,null,null,null,null,null,null,null,null,null,null,"CA006","Yes"]
[null,null,null,null,"",null,null,null,null,null,null,null,null,null,null,null,null,null,null,null,null,"CA007","No"]
[null,null,null,null,"",null,null,null,null,null,null,null,null,null,null,null,null,null,null,null,null,"CA008","No"]
[null,null,null,null,"",null,null,null,null,null,null,null,null,null,null,null,null,null,null,null,null,"CA009","Yes"]
[null,null,null,null,"",null,null,null,null,null,null,null,null,null,null,null,null,null,null,null,null,"CA010","No"]
[null,null,null,null,"",null,null,null,null,null,null,null,null,null,null,null,null,null,null,null,null,"CA011","No"]
[null,null,null,null,"",null,null,null,null,null,null,null,null,null,null,null,null,null,null,null,null,"CA014","No"]
[null,null,null,null,"",null,null,null,null,null,null,null,null,null,null,null,null,null,null,null,null,"CA015","No"]
[null,null,null,null,"",null,null,null,null,null,null,null,null,null,null,null,null,null,null,null,null,"CA017","No"]
[null,null,null,null,"",null,null,null,null,null,null,null,null,null,null,null,null,null,null,null,null,"CA019","No"]
[null,null,null,null,"",null,null,null,null,null,null,null,null,null,null,null,null,null,null,null,null,"CA021","No"]
[null,null,null,null,"",null,null,null,null,null,null,null,null,null,null,null,null,null,null,null,null,"CA022","No"]
[null,null,null,null,"",null,null,null,null,null,null,null,null,null,null,null,null,null,null,null,null,"CA023","No"]
[null,null,null,null,"",null,null,null,null,null,null,null,null,null,null,null,null,null,null,null,null,"CA024","No"]
[null,null,null,null,"",null,null,null,null,null,null,null,null,null,null,null,null,null,null,null,null,"CA025","No"]
[null,null,null,null,"",null,null,null,null,null,null,null,null,null,null,null,null,null,null,null,null,"CA026","No"]
[null,null,null,null,"",null,null,null,null,null,null,null,null,null,null,null,null,null,null,null,null,"CA027","No"]
[null,null,null,null,"",null,null,null,null,null,null,null,null,null,null,null,null,null,null,null,null,"CA028","No"]
[null,null,null,null,"",null,null,null,null,null,null,null,null,null,null,null,null,null,null,null,null,"CA030","No"]
[null,null,null,null,"",null,null,null,null,null,null,null,null,null,null,null,null,null,null,null,null,"CA031","No"]
[null,null,null,null,"",null,null,null,null,null,null,null,null,null,null,null,null,null,null,null,null,"CA032","No"]
[null,null,null,null,"",null,null,null,null,null,null,null,null,null,null,null,null,null,null,null,null,"CA033","No"]
[null,null,null,null,"",null,null,null,null,null,null,null,null,null,null,null,null,null,null,null,null,"CA035","No"]
[null,null,null,null,"",null,null,null,null,null,null,null,null,null,null,null,null,null,null,null,null,"CA039","Yes"]
[null,null,null,null,"",null,null,null,null,null,null,null,null,null,null,null,null,null,null,null,null,"CA041","No"]
[null,null,null,null,"",null,null,null,null,null,null,null,null,null,null,null,null,null,null,null,null,"CA043","No"]
[null,null,null,null,"",null,null,null,null,null,null,null,null,null,null,null,null,null,null,null,null,"CA044","No"]
[null,null,null,null,"",null,null,null,null,null,null,null,null,null,null,null,null,null,null,null,null,"CA046","No"]
[null,null,null,null,"",null,null,null,null,null,null,null,null,null,null,null,null,null,null,null,null,"CA048","No"]
[null,null,null,null,"",null,null,null,null,null,null,null,null,null,null,null,null,null,null,null,null,"CA050","No"]
[null,null,null,null,"",null,null,null,null,null,null,null,null,null,null,null,null,null,null,null,null,"CA052","No"]
[null,null,null,null,"",null,null,null,null,null,null,null,null,null,null,null,null,null,null,null,null,"CA053","No"]
[null,null,null,null,"",null,null,null,null,null,null,null,null,null,null,null,null,null,null,null,null,"CA058","No"]
[null,null,null,null,"",null,null,null,null,null,null,null,null,null,null,null,null,null,null,null,null,"CA059","No"]
[null,null,null,null,"",null,null,null,null,null,null,null,null,null,null,null,null,null,null,null,null,"CA062","No"]
[null,null,null,null,"",null,null,null,null,null,null,null,null,null,null,null,null,null,null,null,null,"CA062","No"]
[null,null,null,null,"",null,null,null,null,null,null,null,null,null,null,null,null,null,null,null,null,"CA058","No"]
[null,null,null,null,"",null,null,null,null,null,null,null,null,null,null,null,null,null,null,null,null,"CA059","Yes"]
[null,null,null,null,"",null,null,null,null,null,null,null,null,null,null,null,null,null,null,null,null,"CA062","No"]
[null,null,null,null,"",null,null,null,null,null,null,null,null,null,null,null,null,null,null,null,null,"CA063","No"]
[null,null,null,null,"",null,null,null,null,null,null,null,null,null,null,null,null,null,null,null,null,"CA064","No"]
[null,null,null,null,"",null,null,null,null,null,null,null,null,null,null,null,null,null,null,null,null,"CA067","No"]
[null,null,null,null,"",null,null,null,null,null,null,null,null,null,null,null,null,null,null,null,null,"CA069","No"]
[null,null,null,null,"",null,null,null,null,null,null,null,null,null,null,null,null,null,null,null,null,"CA070","No"]
[null,null,null,null,"",null,null,null,null,null,null,null,null,null,null,null,null,null,null,null,null,"CA072","No"]
[null,null,null,null,{"$f":"LEFT(F323,2)","v":""},null,null,null,null,null,null,null,null,null,null,null,null,null,null,null,null,"CA074","No"]
[null,null,null,null,"",null,null,null,null,null,null,null,null,null,null,null,null,null,null,null,null,"CA076","No"]
[null,null,null,null,"",null,null,null,null,null,null,null,null,null,null,null,null,null,null,null,null,"CA081","No"]
[null,null,null,null,"",null,null,null,null,null,null,null,null,null,null,null,null,null,null,null,null,"CA084","No"]
[null,null,null,null,"",null,null,null,null,null,null,null,null,null,null,null,null,null,null,null,null,"CA092","No"]
[null,null,null,null,"",null,null,null,null,null,null,null,null,null,null,null,null,null,null,null,null,"CA108","No"]
[null,null,null,null,"",null,null,null,null,null,null,null,null,null,null,null,null,null,null,null,null,"CA120","No"]
[null,null,null,null,"",null,null,null,null,null,null,null,null,null,null,null,null,null,null,null,null,"CA139","No"]
[null,null,null,null,"",null,null,null,null,null,null,null,null,null,null,null,null,null,null,null,null,"CA142","Yes"]
[null,null,null,null,"",null,null,null,null,null,null,null,null,null,null,null,null,null,null,null,null,"CA143","No"]
[null,null,null,null,"",null,null,null,null,null,null,null,null,null,null,null,null,null,null,null,null,"CO001","No"]
[null,null,null,null,"",null,null,null,null,null,null,null,null,null,null,null,null,null,null,null,null,"CO002","No"]
[null,null,null,null,"",null,null,null,null,null,null,null,null,null,null,null,null,null,null,null,null,"CO003","No"]
[null,null,null,null,"",null,null,null,null,null,null,null,null,null,null,null,null,null,null,null,null,"CO004","No"]
[null,null,null,null,"",null,null,null,null,null,null,null,null,null,null,null,null,null,null,null,null,"CO005","No"]
[null,null,null,null,"",null,null,null,null,null,null,null,null,null,null,null,null,null,null,null,null,"CO006","No"]
[null,null,null,null,"",null,null,null,null,null,null,null,null,null,null,null,null,null,null,null,null,"CO007","No"]
[null,null,null,null,"",null,null,null,null,null,null,null,null,null,null,null,null,null,null,null,null,"CO008","No"]
[null,null,null,null,"",null,null,null,null,null,null,null,null,null,null,null,null,null,null,null,null,"CO009","No"]
[null,null,null,null,"",null,null,null,null,null,null,null,null,null,null,null,null,null,null,null,null,"CO011","No"]
[null,null,null,null,"",null,null,null,null,null,null,null,null,null,null,null,null,null,null,null,null,"CO012","No"]
[null,null,null,null,"",null,null,null,null,null,null,null,null,null,null,null,null,null,null,null,null,"CO013","No"]
[null,null,null,null,"",null,null,null,null,null,null,null,null,null,null,null,null,null,null,null,null,"CO014","No"]
[null,null,null,null,"",null,null,null,null,null,null,null,null,null,null,null,null,null,null,null,null,"CO015","No"]
[null,null,null,null,"",null,null,null,null,null,null,null,null,null,null,null,null,null,null,null,null,"CO016","No"]
[null,null,null,null,"",null,null,null,null,null,null,null,null,null,null,null,null,null,null,null,null,"CO017","No"]
[null,null,null,null,"",null,null,null,null,null,null,null,null,null,null,null,null,null,null,null,null,"CO018","No"]
[null,null,null,null,"",null,null,null,null,null,null,null,null,null,null,null,null,null,null,null,null,"CO019","No"]
[null,null,null,null,"",null,null,null,null,null,null,null,null,null,null,null,null,null,null,null,null,"CO020","No"]
[null,null,null,null,"",null,null,null,null,null,null,null,null,null,null,null,null,null,null,null,null,"CO021","No"]
[null,null,null,null,"",null,null,null,null,null,null,null,null,null,null,null,null,null,null,null,null,"CO022","No"]
[null,null,null,null,"",null,null,null,null,null,null,null,null,null,null,null,null,null,null,null,null,"CO023","No"]
[null,null,null,null,"",null,null,null,null,null,null,null,null,null,null,null,null,null,null,null,null,"CO025","No"]
[null,null,null,null,"",null,null,null,null,null,null,null,null,null,null,null,null,null,null,null,null,"CO026","No"]
[null,null,null,null,"",null,null,null,null,null,null,null,null,null,null,null,null,null,null,null,null,"CO028","No"]
[null,null,null,null,"",null,null,null,null,null,null,null,null,null,null,null,null,null,null,null,null,"CO029","No"]
[null,null,null,null,"",null,null,null,null,null,null,null,null,null,null,null,null,null,null,null,null,"CO030","No"]
[null,null,null,null,"",null,null,null,null,null,null,null,null,null,null,null,null,null,null,null,null,"CO031","No"]
[null,null,null,null,"",null,null,null,null,null,null,null,null,null,null,null,null,null,null,null,null,"CO034","No"]
[null,null,null,null,"",null,null,null,null,null,null,null,null,null,null,null,null,null,null,null,null,"CO035","No"]
[null,null,null,null,"",null,null,null,null,null,null,null,null,null,null,null,null,null,null,null,null,"CO036","No"]
[null,null,null,null,"",null,null,null,null,null,null,null,null,null,null,null,null,null,null,null,null,"CO037","No"]
[null,null,null,null,"",null,null,null,null,null,null,null,null,null,null,null,null,null,null,null,null,"CO038","No"]
[null,null,null,null,"",null,null,null,null,null,null,null,null,null,null,null,null,null,null,null,null,"CO040","No"]
[null,null,null,null,"",null,null,null,null,null,null,null,null,null,null,null,null,null,null,null,null,"CO041","No"]
[null,null,null,null,"",null,null,null,null,null,null,null,null,null,null,null,null,null,null,null,null,"CO043","No"]
[null,null,null,null,"",null,null,null,null,null,null,null,null,null,null,null,null,null,null,null,null,"CO044","No"]
[null,null,null,null,"",null,null,null,null,null,null,null,null,null,null,null,null,null,null,null,null,"CO048","No"]
[null,null,null,null,"",null,null,null,null,null,null,null,null,null,null,null,null,null,null,null,null,"CO049","No"]
[null,null,null,null,"",null,null,null,null,null,null,null,null,null,null,null,null,null,null,null,null,"CO051","No"]
[null,null,null,null,"",null,null,null,null,null,null,null,null,null,null,null,null,null,null,null,null,"CO052","No"]
[null,null,null,null,"",null,null,null,null,null,null,null,null,null,null,null,null,null,null,null,null,"CO058","No"]
[null,null,null,null,"",null,null,null,null,null,null,null,null,null,null,null,null,null,null,null,null,"CO059","No"]
[null,null,null,null,"",null,null,null,null,null,null,null,null,null,null,null,null,null,null,null,null,"CO061","No"]
[null,null,null,null,"",null,null,null,null,null,null,null,null,null,null,null,null,null,null,null,null,"CO070","No"]
[null,null,null,null,"",null,null,null,null,null,null,null,null,null,null,null,null,null,null,null,null,"CO071","Yes"]
[null,null,null,null,"",null,null,null,null,null,null,null,null,null,null,null,null,null,null,null,null,"CO079","Yes"]
[null,null,null,null,"",null,null,null,null,null,null,null,null,null,null,null,null,null,null,null,null,"CT001","Yes"]
[null,null,null,null,"",null,null,null,null,null,null,null,null,null,null,null,null,null,null,null,null,"CT002","No"]
[null,null,null,null,"",null,null,null,null,null,null,null,null,null,null,null,null,null,null,null,null,"CT003","Yes"]
[null,null,null,null,"",null,null,null,null,null,null,null,null,null,null,null,null,null,null,null,null,"CT004","No"]
[null,null,null,null,"",null,null,null,null,null,null,null,null,null,null,null,null,null,null,null,null,"CT005","No"]
[null,null,null,null,"",null,null,null,null,null,null,null,null,null,null,null,null,null,null,null,null,"CT006","No"]
[null,null,null,null,"",null,null,null,null,null,null,null,null,null,null,null,null,null,null,null,null,"CT007","No"]
[null,null,null,null,{"$f":"LEFT(F387,2)","v":""},null,null,null,null,null,null,null,null,null,null,null,null,null,null,null,null,"CT009","No"]
[null,null,null,null,"",null,null,null,null,null,null,null,null,null,null,null,null,null,null,null,null,"CT010","Yes"]
[null,null,null,null,"",null,null,null,null,null,null,null,null,null,null,null,null,null,null,null,null,"CT011","No"]
[null,null,null,null,"",null,null,null,null,null,null,null,null,null,null,null,null,null,null,null,null,"CT013","No"]
[null,null,null,null,"",null,null,null,null,null,null,null,null,null,null,null,null,null,null,null,null,"CT015","No"]
[null,null,null,null,"",null,null,null,null,null,null,null,null,null,null,null,null,null,null,null,null,"CT018","No"]
[null,null,null,null,"",null,null,null,null,null,null,null,null,null,null,null,null,null,null,null,null,"CT019","No"]
[null,null,null,null,"",null,null,null,null,null,null,null,null,null,null,null,null,null,null,null,null,"CT020","No"]
[null,null,null,null,"",null,null,null,null,null,null,null,null,null,null,null,null,null,null,null,null,"CT022","No"]
[null,null,null,null,"",null,null,null,null,null,null,null,null,null,null,null,null,null,null,null,null,"CT023","No"]
[null,null,null,null,"",null,null,null,null,null,null,null,null,null,null,null,null,null,null,null,null,"CT024","No"]
[null,null,null,null,"",null,null,null,null,null,null,null,null,null,null,null,null,null,null,null,null,"CT025","No"]
[null,null,null,null,"",null,null,null,null,null,null,null,null,null,null,null,null,null,null,null,null,"CT026","No"]
[null,null,null,null,"",null,null,null,null,null,null,null,null,null,null,null,null,null,null,null,null,"CT027","Yes"]
[null,null,null,null,"",null,null,null,null,null,null,null,null,null,null,null,null,null,null,null,null,"CT028","No"]
[null,null,null,null,"",null,null,null,null,null,null,null,null,null,null,null,null,null,null,null,null,"CT029","No"]
[null,null,null,null,"",null,null,null,null,null,null,null,null,null,null,null,null,null,null,null,null,"CT030","No"]
[null,null,null,null,"",null,null,null,null,null,null,null,null,null,null,null,null,null,null,null,null,"CT031","No"]
[null,null,null,null,"",null,null,null,null,null,null,null,null,null,null,null,null,null,null,null,null,"CT032","No"]
[null,null,null,null,"",null,null,null,null,null,null,null,null,null,null,null,null,null,null,null,null,"CT035","No"]
[null,null,null,null,"",null,null,null,null,null,null,null,null,null,null,null,null,null,null,null,null,"CT036","No"]
[null,null,null,null,"",null,null,null,null,null,null,null,null,null,null,null,null,null,null,null,null,"CT039","No"]
[null,null,null,null,"",null,null,null,null,null,null,null,null,null,null,null,null,null,null,null,null,"CT040","No"]
[null,null,null,null,"",null,null,null,null,null,null,null,null,null,null,null,null,null,null,null,null,"CT047","No"]
[null,null,null,null,"",null,null,null,null,null,null,null,null,null,null,null,null,null,null,null,null,"CT054","No"]
[null,null,null,null,"",null,null,null,null,null,null,null,null,null,null,null,null,null,null,null,null,"CT056","No"]
[null,null,null,null,"",null,null,null,null,null,null,null,null,null,null,null,null,null,null,null,null,"CT066","No"]
[null,null,null,null,"",null,null,null,null,null,null,null,null,null,null,null,null,null,null,null,null,"DC001","No"]
[null,null,null,null,"",null,null,null,null,null,null,null,null,null,null,null,null,null,null,null,null,"DE001","No"]
[null,null,null,null,"",null,null,null,null,null,null,null,null,null,null,null,null,null,null,null,null,"DE002","No"]
[null,null,null,null,"",null,null,null,null,null,null,null,null,null,null,null,null,null,null,null,null,"DE003","Yes"]
[null,null,null,null,"",null,null,null,null,null,null,null,null,null,null,null,null,null,null,null,null,"DE004","No"]
[null,null,null,null,"",null,null,null,null,null,null,null,null,null,null,null,null,null,null,null,null,"FL001","No"]
[null,null,null,null,"",null,null,null,null,null,null,null,null,null,null,null,null,null,null,null,null,"FL002","No"]
[null,null,null,null,"",null,null,null,null,null,null,null,null,null,null,null,null,null,null,null,null,"FL003","Yes"]
[null,null,null,null,"",null,null,null,null,null,null,null,null,null,null,null,null,null,null,null,null,"FL004","No"]
[null,null,null,null,"",null,null,null,null,null,null,null,null,null,null,null,null,null,null,null,null,"FL005","No"]
[null,null,null,null,"",null,null,null,null,null,null,null,null,null,null,null,null,null,null,null,null,"FL006","No"]
[null,null,null,null,"",null,null,null,null,null,null,null,null,null,null,null,null,null,null,null,null,"FL007","No"]
[null,null,null,null,"",null,null,null,null,null,null,null,null,null,null,null,null,null,null,null,null,"FL008","No"]
[null,null,null,null,"",null,null,null,null,null,null,null,null,null,null,null,null,null,null,null,null,"FL009","No"]
[null,null,null,null,"",null,null,null,null,null,null,null,null,null,null,null,null,null,null,null,null,"FL010","No"]
[null,null,null,null,"",null,null,null,null,null,null,null,null,null,null,null,null,null,null,null,null,"FL011","No"]
[null,null,null,null,"",null,null,null,null,null,null,null,null,null,null,null,null,null,null,null,null,"FL012","No"]
[null,null,null,null,"",null,null,null,null,null,null,null,null,null,null,null,null,null,null,null,null,"FL013","No"]
[null,null,null,null,"",null,null,null,null,null,null,null,null,null,null,null,null,null,null,null,null,"FL015","No"]
[null,null,null,null,"",null,null,null,null,null,null,null,null,null,null,null,null,null,null,null,null,"FL016","No"]
[null,null,null,null,"",null,null,null,null,null,null,null,null,null,null,null,null,null,null,null,null,"FL017","No"]
[null,null,null,null,"",null,null,null,null,null,null,null,null,null,null,null,null,null,null,null,null,"FL018","No"]
[null,null,null,null,"",null,null,null,null,null,null,null,null,null,null,null,null,null,null,null,null,"FL019","No"]
[null,null,null,null,"",null,null,null,null,null,null,null,null,null,null,null,null,null,null,null,null,"FL020","No"]
[null,null,null,null,"",null,null,null,null,null,null,null,null,null,null,null,null,null,null,null,null,"FL021","No"]
[null,null,null,null,"",null,null,null,null,null,null,null,null,null,null,null,null,null,null,null,null,"FL022","No"]
[null,null,null,null,"",null,null,null,null,null,null,null,null,null,null,null,null,null,null,null,null,"FL023","No"]
[null,null,null,null,"",null,null,null,null,null,null,null,null,null,null,null,null,null,null,null,null,"FL024","No"]
[null,null,null,null,"",null,null,null,null,null,null,null,null,null,null,null,null,null,null,null,null,"FL025","No"]
[null,null,null,null,"",null,null,null,null,null,null,null,null,null,null,null,null,null,null,null,null,"FL026","No"]
[null,null,null,null,"",null,null,null,null,null,null,null,null,null,null,null,null,null,null,null,null,"FL027","No"]
[null,null,null,null,"",null,null,null,null,null,null,null,null,null,null,null,null,null,null,null,null,"FL028","No"]
[null,null,null,null,"",null,null,null,null,null,null,null,null,null,null,null,null,null,null,null,null,"FL030","No"]
[null,null,null,null,"",null,null,null,null,null,null,null,null,null,null,null,null,null,null,null,null,"FL031","No"]
[null,null,null,null,"",null,null,null,null,null,null,null,null,null,null,null,null,null,null,null,null,"FL032","No"]
[null,null,null,null,"",null,null,null,null,null,null,null,null,null,null,null,null,null,null,null,null,"FL033","No"]
[null,null,null,null,"",null,null,null,null,null,null,null,null,null,null,null,null,null,null,null,null,"FL034","No"]
[null,null,null,null,{"$f":"LEFT(F451,2)","v":""},null,null,null,null,null,null,null,null,null,null,null,null,null,null,null,null,"FL035","No"]
[null,null,null,null,"",null,null,null,null,null,null,null,null,null,null,null,null,null,null,null,null,"FL036","No"]
[null,null,null,null,"",null,null,null,null,null,null,null,null,null,null,null,null,null,null,null,null,"FL037","No"]
[null,null,null,null,"",null,null,null,null,null,null,null,null,null,null,null,null,null,null,null,null,"FL038","No"]
[null,null,null,null,"",null,null,null,null,null,null,null,null,null,null,null,null,null,null,null,null,"FL039","Yes"]
[null,null,null,null,"",null,null,null,null,null,null,null,null,null,null,null,null,null,null,null,null,"FL040","No"]
[null,null,null,null,"",null,null,null,null,null,null,null,null,null,null,null,null,null,null,null,null,"FL041","No"]
[null,null,null,null,"",null,null,null,null,null,null,null,null,null,null,null,null,null,null,null,null,"FL042","No"]
[null,null,null,null,"",null,null,null,null,null,null,null,null,null,null,null,null,null,null,null,null,"FL045","Yes"]
[null,null,null,null,"",null,null,null,null,null,null,null,null,null,null,null,null,null,null,null,null,"FL046","No"]
[null,null,null,null,"",null,null,null,null,null,null,null,null,null,null,null,null,null,null,null,null,"FL047","No"]
[null,null,null,null,"",null,null,null,null,null,null,null,null,null,null,null,null,null,null,null,null,"FL049","No"]
[null,null,null,null,"",null,null,null,null,null,null,null,null,null,null,null,null,null,null,null,null,"FL050","No"]
[null,null,null,null,"",null,null,null,null,null,null,null,null,null,null,null,null,null,null,null,null,"FL051","No"]
[null,null,null,null,"",null,null,null,null,null,null,null,null,null,null,null,null,null,null,null,null,"FL052","No"]
[null,null,null,null,"",null,null,null,null,null,null,null,null,null,null,null,null,null,null,null,null,"FL053","No"]
[null,null,null,null,"",null,null,null,null,null,null,null,null,null,null,null,null,null,null,null,null,"FL054","No"]
[null,null,null,null,"",null,null,null,null,null,null,null,null,null,null,null,null,null,null,null,null,"FL055","No"]
[null,null,null,null,"",null,null,null,null,null,null,null,null,null,null,null,null,null,null,null,null,"FL056","No"]
[null,null,null,null,"",null,null,null,null,null,null,null,null,null,null,null,null,null,null,null,null,"FL057","No"]
[null,null,null,null,"",null,null,null,null,null,null,null,null,null,null,null,null,null,null,null,null,"FL058","No"]
[null,null,null,null,"",null,null,null,null,null,null,null,null,null,null,null,null,null,null,null,null,"FL060","No"]
[null,null,null,null,"",null,null,null,null,null,null,null,null,null,null,null,null,null,null,null,null,"FL062","No"]
[null,null,null,null,"",null,null,null,null,null,null,null,null,null,null,null,null,null,null,null,null,"FL063","No"]
[null,null,null,null,"",null,null,null,null,null,null,null,null,null,null,null,null,null,null,null,null,"FL064","No"]
[null,null,null,null,"",null,null,null,null,null,null,null,null,null,null,null,null,null,null,null,null,"FL065","No"]
[null,null,null,null,"",null,null,null,null,null,null,null,null,null,null,null,null,null,null,null,null,"FL066","No"]
[null,null,null,null,"",null,null,null,null,null,null,null,null,null,null,null,null,null,null,null,null,"FL069","No"]
[null,null,null,null,"",null,null,null,null,null,null,null,null,null,null,null,null,null,null,null,null,"FL070","No"]
[null,null,null,null,"",null,null,null,null,null,null,null,null,null,null,null,null,null,null,null,null,"FL071","No"]
[null,null,null,null,"",null,null,null,null,null,null,null,null,null,null,null,null,null,null,null,null,"FL072","No"]
[null,null,null,null,"",null,null,null,null,null,null,null,null,null,null,null,null,null,null,null,null,"FL073","No"]
[null,null,null,null,"",null,null,null,null,null,null,null,null,null,null,null,null,null,null,null,null,"FL074","No"]
[null,null,null,null,"",null,null,null,null,null,null,null,null,null,null,null,null,null,null,null,null,"FL075","No"]
[null,null,null,null,"",null,null,null,null,null,null,null,null,null,null,null,null,null,null,null,null,"FL076","No"]
[null,null,null,null,"",null,null,null,null,null,null,null,null,null,null,null,null,null,null,null,null,"FL079","No"]
[null,null,null,null,"",null,null,null,null,null,null,null,null,null,null,null,null,null,null,null,null,"FL080","No"]
[null,null,null,null,"",null,null,null,null,null,null,null,null,null,null,null,null,null,null,null,null,"FL081","No"]
[null,null,null,null,"",null,null,null,null,null,null,null,null,null,null,null,null,null,null,null,null,"FL082","No"]
[null,null,null,null,"",null,null,null,null,null,null,null,null,null,null,null,null,null,null,null,null,"FL083","No"]
[null,null,null,null,"",null,null,null,null,null,null,null,null,null,null,null,null,null,null,null,null,"FL104","No"]
[null,null,null,null,"",null,null,null,null,null,null,null,null,null,null,null,null,null,null,null,null,"FL105","No"]
[null,null,null,null,"",null,null,null,null,null,null,null,null,null,null,null,null,null,null,null,null,"FL116","No"]
[null,null,null,null,"",null,null,null,null,null,null,null,null,null,null,null,null,null,null,null,null,"FL119","No"]
[null,null,null,null,"",null,null,null,null,null,null,null,null,null,null,null,null,null,null,null,null,"FL125","No"]
[null,null,null,null,"",null,null,null,null,null,null,null,null,null,null,null,null,null,null,null,null,"FL128","No"]
[null,null,null,null,"",null,null,null,null,null,null,null,null,null,null,null,null,null,null,null,null,"FL136","No"]
[null,null,null,null,"",null,null,null,null,null,null,null,null,null,null,null,null,null,null,null,null,"FL139","Yes"]
[null,null,null,null,"",null,null,null,null,null,null,null,null,null,null,null,null,null,null,null,null,"FL144","No"]
[null,null,null,null,"",null,null,null,null,null,null,null,null,null,null,null,null,null,null,null,null,"GA001","No"]
[null,null,null,null,"",null,null,null,null,null,null,null,null,null,null,null,null,null,null,null,null,"GA002","No"]
[null,null,null,null,"",null,null,null,null,null,null,null,null,null,null,null,null,null,null,null,null,"GA003","No"]
[null,null,null,null,"",null,null,null,null,null,null,null,null,null,null,null,null,null,null,null,null,"GA004","No"]
[null,null,null,null,"",null,null,null,null,null,null,null,null,null,null,null,null,null,null,null,null,"GA006","No"]
[null,null,null,null,"",null,null,null,null,null,null,null,null,null,null,null,null,null,null,null,null,"GA007","No"]
[null,null,null,null,"",null,null,null,null,null,null,null,null,null,null,null,null,null,null,null,null,"GA009","No"]
[null,null,null,null,"",null,null,null,null,null,null,null,null,null,null,null,null,null,null,null,null,"GA010","No"]
[null,null,null,null,"",null,null,null,null,null,null,null,null,null,null,null,null,null,null,null,null,"GA011","No"]
[null,null,null,null,"",null,null,null,null,null,null,null,null,null,null,null,null,null,null,null,null,"GA023","No"]
[null,null,null,null,"",null,null,null,null,null,null,null,null,null,null,null,null,null,null,null,null,"GA024","No"]
[null,null,null,null,"",null,null,null,null,null,null,null,null,null,null,null,null,null,null,null,null,"GA025","No"]
[null,null,null,null,"",null,null,null,null,null,null,null,null,null,null,null,null,null,null,null,null,"GA026","No"]
[null,null,null,null,"",null,null,null,null,null,null,null,null,null,null,null,null,null,null,null,null,"GA028","No"]
[null,null,null,null,"",null,null,null,null,null,null,null,null,null,null,null,null,null,null,null,null,"GA059","No"]
[null,null,null,null,{"$f":"LEFT(F515,2)","v":""},null,null,null,null,null,null,null,null,null,null,null,null,null,null,null,null,"GA060","No"]
[null,null,null,null,"",null,null,null,null,null,null,null,null,null,null,null,null,null,null,null,null,"GA061","No"]
[null,null,null,null,"",null,null,null,null,null,null,null,null,null,null,null,null,null,null,null,null,"GA062","No"]
[null,null,null,null,"",null,null,null,null,null,null,null,null,null,null,null,null,null,null,null,null,"GA063","No"]
[null,null,null,null,"",null,null,null,null,null,null,null,null,null,null,null,null,null,null,null,null,"GA064","No"]
[null,null,null,null,"",null,null,null,null,null,null,null,null,null,null,null,null,null,null,null,null,"GA065","No"]
[null,null,null,null,"",null,null,null,null,null,null,null,null,null,null,null,null,null,null,null,null,"GA066","No"]
[null,null,null,null,"",null,null,null,null,null,null,null,null,null,null,null,null,null,null,null,null,"GA067","No"]
[null,null,null,null,"",null,null,null,null,null,null,null,null,null,null,null,null,null,null,null,null,"GA069","No"]
[null,null,null,null,"",null,null,null,null,null,null,null,null,null,null,null,null,null,null,null,null,"GA070","No"]
[null,null,null,null,"",null,null,null,null,null,null,null,null,null,null,null,null,null,null,null,null,"GA071","No"]
[null,null,null,null,"",null,null,null,null,null,null,null,null,null,null,null,null,null,null,null,null,"GA072","No"]
[null,null,null,null,"",null,null,null,null,null,null,null,null,null,null,null,null,null,null,null,null,"GA073","No"]
[null,null,null,null,"",null,null,null,null,null,null,null,null,null,null,null,null,null,null,null,null,"GA074","No"]
[null,null,null,null,"",null,null,null,null,null,null,null,null,null,null,null,null,null,null,null,null,"GA076","No"]
[null,null,null,null,"",null,null,null,null,null,null,null,null,null,null,null,null,null,null,null,null,"GA077","No"]
[null,null,null,null,"",null,null,null,null,null,null,null,null,null,null,null,null,null,null,null,null,"GA078","No"]
[null,null,null,null,"",null,null,null,null,null,null,null,null,null,null,null,null,null,null,null,null,"GA080","No"]
[null,null,null,null,"",null,null,null,null,null,null,null,null,null,null,null,null,null,null,null,null,"GA081","No"]
[null,null,null,null,"",null,null,null,null,null,null,null,null,null,null,null,null,null,null,null,null,"GA082","No"]
[null,null,null,null,"",null,null,null,null,null,null,null,null,null,null,null,null,null,null,null,null,"GA083","No"]
[null,null,null,null,"",null,null,null,null,null,null,null,null,null,null,null,null,null,null,null,null,"GA084","No"]
[null,null,null,null,"",null,null,null,null,null,null,null,null,null,null,null,null,null,null,null,null,"GA085","No"]
[null,null,null,null,"",null,null,null,null,null,null,null,null,null,null,null,null,null,null,null,null,"GA086","No"]
[null,null,null,null,"",null,null,null,null,null,null,null,null,null,null,null,null,null,null,null,null,"GA087","No"]
[null,null,null,null,"",null,null,null,null,null,null,null,null,null,null,null,null,null,null,null,null,"GA088","No"]
[null,null,null,null,"",null,null,null,null,null,null,null,null,null,null,null,null,null,null,null,null,"GA089","No"]
[null,null,null,null,"",null,null,null,null,null,null,null,null,null,null,null,null,null,null,null,null,"GA090","No"]
[null,null,null,null,"",null,null,null,null,null,null,null,null,null,null,null,null,null,null,null,null,"GA091","No"]
[null,null,null,null,"",null,null,null,null,null,null,null,null,null,null,null,null,null,null,null,null,"GA092","No"]
[null,null,null,null,"",null,null,null,null,null,null,null,null,null,null,null,null,null,null,null,null,"GA093","No"]
[null,null,null,null,"",null,null,null,null,null,null,null,null,null,null,null,null,null,null,null,null,"GA094","No"]
[null,null,null,null,"",null,null,null,null,null,null,null,null,null,null,null,null,null,null,null,null,"GA095","No"]
[null,null,null,null,"",null,null,null,null,null,null,null,null,null,null,null,null,null,null,null,null,"GA096","No"]
[null,null,null,null,"",null,null,null,null,null,null,null,null,null,null,null,null,null,null,null,null,"GA097","No"]
[null,null,null,null,"",null,null,null,null,null,null,null,null,null,null,null,null,null,null,null,null,"GA098","No"]
[null,null,null,null,"",null,null,null,null,null,null,null,null,null,null,null,null,null,null,null,null,"GA099","No"]
[null,null,null,null,"",null,null,null,null,null,null,null,null,null,null,null,null,null,null,null,null,"GA100","No"]
[null,null,null,null,"",null,null,null,null,null,null,null,null,null,null,null,null,null,null,null,null,"GA101","No"]
[null,null,null,null,"",null,null,null,null,null,null,null,null,null,null,null,null,null,null,null,null,"GA103","No"]
[null,null,null,null,"",null,null,null,null,null,null,null,null,null,null,null,null,null,null,null,null,"GA104","No"]
[null,null,null,null,"",null,null,null,null,null,null,null,null,null,null,null,null,null,null,null,null,"GA105","No"]
[null,null,null,null,"",null,null,null,null,null,null,null,null,null,null,null,null,null,null,null,null,"GA106","No"]
[null,null,null,null,"",null,null,null,null,null,null,null,null,null,null,null,null,null,null,null,null,"GA107","No"]
[null,null,null,null,"",null,null,null,null,null,null,null,null,null,null,null,null,null,null,null,null,"GA108","No"]
[null,null,null,null,"",null,null,null,null,null,null,null,null,null,null,null,null,null,null,null,null,"GA109","No"]
[null,null,null,null,"",null,null,null,null,null,null,null,null,null,null,null,null,null,null,null,null,"GA110","No"]
[null,null,null,null,"",null,null,null,null,null,null,null,null,null,null,null,null,null,null,null,null,"GA111","No"]
[null,null,null,null,"",null,null,null,null,null,null,null,null,null,null,null,null,null,null,null,null,"GA112","No"]
[null,null,null,null,"",null,null,null,null,null,null,null,null,null,null,null,null,null,null,null,null,"GA113","No"]
[null,null,null,null,"",null,null,null,null,null,null,null,null,null,null,null,null,null,null,null,null,"GA114","Yes"]
[null,null,null,null,"",null,null,null,null,null,null,null,null,null,null,null,null,null,null,null,null,"GA115","No"]
[null,null,null,null,"",null,null,null,null,null,null,null,null,null,null,null,null,null,null,null,null,"GA116","No"]
[null,null,null,null,"",null,null,null,null,null,null,null,null,null,null,null,null,null,null,null,null,"GA117","No"]
[null,null,null,null,"",null,null,null,null,null,null,null,null,null,null,null,null,null,null,null,null,"GA118","No"]
[null,null,null,null,"",null,null,null,null,null,null,null,null,null,null,null,null,null,null,null,null,"GA119","No"]
[null,null,null,null,"",null,null,null,null,null,null,null,null,null,null,null,null,null,null,null,null,"GA120","No"]
[null,null,null,null,"",null,null,null,null,null,null,null,null,null,null,null,null,null,null,null,null,"GA123","No"]
[null,null,null,null,"",null,null,null,null,null,null,null,null,null,null,null,null,null,null,null,null,"GA124","No"]
[null,null,null,null,"",null,null,null,null,null,null,null,null,null,null,null,null,null,null,null,null,"GA125","No"]
[null,null,null,null,"",null,null,null,null,null,null,null,null,null,null,null,null,null,null,null,null,"GA126","No"]
[null,null,null,null,"",null,null,null,null,null,null,null,null,null,null,null,null,null,null,null,null,"GA127","No"]
[null,null,null,null,"",null,null,null,null,null,null,null,null,null,null,null,null,null,null,null,null,"GA128","No"]
[null,null,null,null,"",null,null,null,null,null,null,null,null,null,null,null,null,null,null,null,null,"GA129","No"]
[null,null,null,null,{"$f":"LEFT(F579,2)","v":""},null,null,null,null,null,null,null,null,null,null,null,null,null,null,null,null,"GA130","No"]
[null,null,null,null,"",null,null,null,null,null,null,null,null,null,null,null,null,null,null,null,null,"GA131","No"]
[null,null,null,null,"",null,null,null,null,null,null,null,null,null,null,null,null,null,null,null,null,"GA132","No"]
[null,null,null,null,"",null,null,null,null,null,null,null,null,null,null,null,null,null,null,null,null,"GA133","No"]
[null,null,null,null,"",null,null,null,null,null,null,null,null,null,null,null,null,null,null,null,null,"GA134","No"]
[null,null,null,null,"",null,null,null,null,null,null,null,null,null,null,null,null,null,null,null,null,"GA135","No"]
[null,null,null,null,"",null,null,null,null,null,null,null,null,null,null,null,null,null,null,null,null,"GA136","No"]
[null,null,null,null,"",null,null,null,null,null,null,null,null,null,null,null,null,null,null,null,null,"GA137","No"]
[null,null,null,null,"",null,null,null,null,null,null,null,null,null,null,null,null,null,null,null,null,"GA138","No"]
[null,null,null,null,"",null,null,null,null,null,null,null,null,null,null,null,null,null,null,null,null,"GA139","No"]
[null,null,null,null,"",null,null,null,null,null,null,null,null,null,null,null,null,null,null,null,null,"GA141","No"]
[null,null,null,null,"",null,null,null,null,null,null,null,null,null,null,null,null,null,null,null,null,"GA142","No"]
[null,null,null,null,"",null,null,null,null,null,null,null,null,null,null,null,null,null,null,null,null,"GA144","No"]
[null,null,null,null,"",null,null,null,null,null,null,null,null,null,null,null,null,null,null,null,null,"GA145","No"]
[null,null,null,null,"",null,null,null,null,null,null,null,null,null,null,null,null,null,null,null,null,"GA147","No"]
[null,null,null,null,"",null,null,null,null,null,null,null,null,null,null,null,null,null,null,null,null,"GA148","No"]
[null,null,null,null,"",null,null,null,null,null,null,null,null,null,null,null,null,null,null,null,null,"GA152","No"]
[null,null,null,null,"",null,null,null,null,null,null,null,null,null,null,null,null,null,null,null,null,"GA153","No"]
[null,null,null,null,"",null,null,null,null,null,null,null,null,null,null,null,null,null,null,null,null,"GA155","No"]
[null,null,null,null,"",null,null,null,null,null,null,null,null,null,null,null,null,null,null,null,null,"GA157","No"]
[null,null,null,null,"",null,null,null,null,null,null,null,null,null,null,null,null,null,null,null,null,"GA158","No"]
[null,null,null,null,"",null,null,null,null,null,null,null,null,null,null,null,null,null,null,null,null,"GA160","No"]
[null,null,null,null,"",null,null,null,null,null,null,null,null,null,null,null,null,null,null,null,null,"GA161","No"]
[null,null,null,null,"",null,null,null,null,null,null,null,null,null,null,null,null,null,null,null,null,"GA162","No"]
[null,null,null,null,"",null,null,null,null,null,null,null,null,null,null,null,null,null,null,null,null,"GA163","No"]
[null,null,null,null,"",null,null,null,null,null,null,null,null,null,null,null,null,null,null,null,null,"GA165","No"]
[null,null,null,null,"",null,null,null,null,null,null,null,null,null,null,null,null,null,null,null,null,"GA166","No"]
[null,null,null,null,"",null,null,null,null,null,null,null,null,null,null,null,null,null,null,null,null,"GA167","No"]
[null,null,null,null,"",null,null,null,null,null,null,null,null,null,null,null,null,null,null,null,null,"GA168","No"]
[null,null,null,null,"",null,null,null,null,null,null,null,null,null,null,null,null,null,null,null,null,"GA169","No"]
[null,null,null,null,"",null,null,null,null,null,null,null,null,null,null,null,null,null,null,null,null,"GA170","No"]
[null,null,null,null,"",null,null,null,null,null,null,null,null,null,null,null,null,null,null,null,null,"GA171","No"]
[null,null,null,null,"",null,null,null,null,null,null,null,null,null,null,null,null,null,null,null,null,"GA172","No"]
[null,null,null,null,"",null,null,null,null,null,null,null,null,null,null,null,null,null,null,null,null,"GA174","No"]
[null,null,null,null,"",null,null,null,null,null,null,null,null,null,null,null,null,null,null,null,null,"GA175","No"]
[null,null,null,null,"",null,null,null,null,null,null,null,null,null,null,null,null,null,null,null,null,"GA176","No"]
[null,null,null,null,"",null,null,null,null,null,null,null,null,null,null,null,null,null,null,null,null,"GA177","No"]
[null,null,null,null,"",null,null,null,null,null,null,null,null,null,null,null,null,null,null,null,null,"GA178","No"]
[null,null,null,null,"",null,null,null,null,null,null,null,null,null,null,null,null,null,null,null,null,"GA179","No"]
[null,null,null,null,"",null,null,null,null,null,null,null,null,null,null,null,null,null,null,null,null,"GA180","No"]
[null,null,null,null,"",null,null,null,null,null,null,null,null,null,null,null,null,null,null,null,null,"GA181","No"]
[null,null,null,null,"",null,null,null,null,null,null,null,null,null,null,null,null,null,null,null,null,"GA182","No"]
[null,null,null,null,"",null,null,null,null,null,null,null,null,null,null,null,null,null,null,null,null,"GA183","No"]
[null,null,null,null,"",null,null,null,null,null,null,null,null,null,null,null,null,null,null,null,null,"GA184","No"]
[null,null,null,null,"",null,null,null,null,null,null,null,null,null,null,null,null,null,null,null,null,"GA185","No"]
[null,null,null,null,"",null,null,null,null,null,null,null,null,null,null,null,null,null,null,null,null,"GA186","No"]
[null,null,null,null,"",null,null,null,null,null,null,null,null,null,null,null,null,null,null,null,null,"GA187","No"]
[null,null,null,null,"",null,null,null,null,null,null,null,null,null,null,null,null,null,null,null,null,"GA188","No"]
[null,null,null,null,"",null,null,null,null,null,null,null,null,null,null,null,null,null,null,null,null,"GA189","No"]
[null,null,null,null,"",null,null,null,null,null,null,null,null,null,null,null,null,null,null,null,null,"GA190","No"]
[null,null,null,null,"",null,null,null,null,null,null,null,null,null,null,null,null,null,null,null,null,"GA191","No"]
[null,null,null,null,"",null,null,null,null,null,null,null,null,null,null,null,null,null,null,null,null,"GA192","No"]
[null,null,null,null,"",null,null,null,null,null,null,null,null,null,null,null,null,null,null,null,null,"GA193","No"]
[null,null,null,null,"",null,null,null,null,null,null,null,null,null,null,null,null,null,null,null,null,"GA194","No"]
[null,null,null,null,"",null,null,null,null,null,null,null,null,null,null,null,null,null,null,null,null,"GA195","No"]
[null,null,null,null,"",null,null,null,null,null,null,null,null,null,null,null,null,null,null,null,null,"GA196","No"]
[null,null,null,null,"",null,null,null,null,null,null,null,null,null,null,null,null,null,null,null,null,"GA197","No"]
[null,null,null,null,"",null,null,null,null,null,null,null,null,null,null,null,null,null,null,null,null,"GA198","No"]
[null,null,null,null,"",null,null,null,null,null,null,null,null,null,null,null,null,null,null,null,null,"GA199","No"]
[null,null,null,null,"",null,null,null,null,null,null,null,null,null,null,null,null,null,null,null,null,"GA200","No"]
[null,null,null,null,"",null,null,null,null,null,null,null,null,null,null,null,null,null,null,null,null,"GA201","No"]
[null,null,null,null,"",null,null,null,null,null,null,null,null,null,null,null,null,null,null,null,null,"GA202","No"]
[null,null,null,null,"",null,null,null,null,null,null,null,null,null,null,null,null,null,null,null,null,"GA203","No"]
[null,null,null,null,"",null,null,null,null,null,null,null,null,null,null,null,null,null,null,null,null,"GA204","No"]
[null,null,null,null,{"$f":"LEFT(F643,2)","v":""},null,null,null,null,null,null,null,null,null,null,null,null,null,null,null,null,"GA205","No"]
[null,null,null,null,"",null,null,null,null,null,null,null,null,null,null,null,null,null,null,null,null,"GA206","No"]
[null,null,null,null,"",null,null,null,null,null,null,null,null,null,null,null,null,null,null,null,null,"GA207","No"]
[null,null,null,null,"",null,null,null,null,null,null,null,null,null,null,null,null,null,null,null,null,"GA208","No"]
[null,null,null,null,"",null,null,null,null,null,null,null,null,null,null,null,null,null,null,null,null,"GA209","No"]
[null,null,null,null,"",null,null,null,null,null,null,null,null,null,null,null,null,null,null,null,null,"GA210","No"]
[null,null,null,null,"",null,null,null,null,null,null,null,null,null,null,null,null,null,null,null,null,"GA211","No"]
[null,null,null,null,"",null,null,null,null,null,null,null,null,null,null,null,null,null,null,null,null,"GA213","No"]
[null,null,null,null,"",null,null,null,null,null,null,null,null,null,null,null,null,null,null,null,null,"GA214","No"]
[null,null,null,null,"",null,null,null,null,null,null,null,null,null,null,null,null,null,null,null,null,"GA216","No"]
[null,null,null,null,"",null,null,null,null,null,null,null,null,null,null,null,null,null,null,null,null,"GA217","No"]
[null,null,null,null,"",null,null,null,null,null,null,null,null,null,null,null,null,null,null,null,null,"GA218","No"]
[null,null,null,null,"",null,null,null,null,null,null,null,null,null,null,null,null,null,null,null,null,"GA220","No"]
[null,null,null,null,"",null,null,null,null,null,null,null,null,null,null,null,null,null,null,null,null,"GA221","No"]
[null,null,null,null,"",null,null,null,null,null,null,null,null,null,null,null,null,null,null,null,null,"GA223","No"]
[null,null,null,null,"",null,null,null,null,null,null,null,null,null,null,null,null,null,null,null,null,"GA224","No"]
[null,null,null,null,"",null,null,null,null,null,null,null,null,null,null,null,null,null,null,null,null,"GA226","No"]
[null,null,null,null,"",null,null,null,null,null,null,null,null,null,null,null,null,null,null,null,null,"GA228","No"]
[null,null,null,null,"",null,null,null,null,null,null,null,null,null,null,null,null,null,null,null,null,"GA229","No"]
[null,null,null,null,"",null,null,null,null,null,null,null,null,null,null,null,null,null,null,null,null,"GA230","No"]
[null,null,null,null,"",null,null,null,null,null,null,null,null,null,null,null,null,null,null,null,null,"GA232","No"]
[null,null,null,null,"",null,null,null,null,null,null,null,null,null,null,null,null,null,null,null,null,"GA233","No"]
[null,null,null,null,"",null,null,null,null,null,null,null,null,null,null,null,null,null,null,null,null,"GA237","No"]
[null,null,null,null,"",null,null,null,null,null,null,null,null,null,null,null,null,null,null,null,null,"GA238","No"]
[null,null,null,null,"",null,null,null,null,null,null,null,null,null,null,null,null,null,null,null,null,"GA239","No"]
[null,null,null,null,"",null,null,null,null,null,null,null,null,null,null,null,null,null,null,null,null,"GA241","No"]
[null,null,null,null,"",null,null,null,null,null,null,null,null,null,null,null,null,null,null,null,null,"GA243","No"]
[null,null,null,null,"",null,null,null,null,null,null,null,null,null,null,null,null,null,null,null,null,"GA244","No"]
[null,null,null,null,"",null,null,null,null,null,null,null,null,null,null,null,null,null,null,null,null,"GA245","No"]
[null,null,null,null,"",null,null,null,null,null,null,null,null,null,null,null,null,null,null,null,null,"GA246","No"]
[null,null,null,null,"",null,null,null,null,null,null,null,null,null,null,null,null,null,null,null,null,"GA247","No"]
[null,null,null,null,"",null,null,null,null,null,null,null,null,null,null,null,null,null,null,null,null,"GA252","No"]
[null,null,null,null,"",null,null,null,null,null,null,null,null,null,null,null,null,null,null,null,null,"GA254","No"]
[null,null,null,null,"",null,null,null,null,null,null,null,null,null,null,null,null,null,null,null,null,"GA263","No"]
[null,null,null,null,"",null,null,null,null,null,null,null,null,null,null,null,null,null,null,null,null,"GA264","No"]
[null,null,null,null,"",null,null,null,null,null,null,null,null,null,null,null,null,null,null,null,null,"GA268","No"]
[null,null,null,null,"",null,null,null,null,null,null,null,null,null,null,null,null,null,null,null,null,"GA280","No"]
[null,null,null,null,"",null,null,null,null,null,null,null,null,null,null,null,null,null,null,null,null,"GA281","No"]
[null,null,null,null,"",null,null,null,null,null,null,null,null,null,null,null,null,null,null,null,null,"GA282","No"]
[null,null,null,null,"",null,null,null,null,null,null,null,null,null,null,null,null,null,null,null,null,"GA283","No"]
[null,null,null,null,"",null,null,null,null,null,null,null,null,null,null,null,null,null,null,null,null,"GA284","No"]
[null,null,null,null,"",null,null,null,null,null,null,null,null,null,null,null,null,null,null,null,null,"GA285","No"]
[null,null,null,null,"",null,null,null,null,null,null,null,null,null,null,null,null,null,null,null,null,"GQ001","No"]
[null,null,null,null,"",null,null,null,null,null,null,null,null,null,null,null,null,null,null,null,null,"HI001","No"]
[null,null,null,null,"",null,null,null,null,null,null,null,null,null,null,null,null,null,null,null,null,"IA001","No"]
[null,null,null,null,"",null,null,null,null,null,null,null,null,null,null,null,null,null,null,null,null,"IA002","Yes"]
[null,null,null,null,"",null,null,null,null,null,null,null,null,null,null,null,null,null,null,null,null,"IA003","No"]
[null,null,null,null,"",null,null,null,null,null,null,null,null,null,null,null,null,null,null,null,null,"IA004","No"]
[null,null,null,null,"",null,null,null,null,null,null,null,null,null,null,null,null,null,null,null,null,"IA005","No"]
[null,null,null,null,"",null,null,null,null,null,null,null,null,null,null,null,null,null,null,null,null,"IA006","No"]
[null,null,null,null,"",null,null,null,null,null,null,null,null,null,null,null,null,null,null,null,null,"IA007","No"]
[null,null,null,null,"",null,null,null,null,null,null,null,null,null,null,null,null,null,null,null,null,"IA008","No"]
[null,null,null,null,"",null,null,null,null,null,null,null,null,null,null,null,null,null,null,null,null,"IA009","No"]
[null,null,null,null,"",null,null,null,null,null,null,null,null,null,null,null,null,null,null,null,null,"IA010","No"]
[null,null,null,null,"",null,null,null,null,null,null,null,null,null,null,null,null,null,null,null,null,"IA011","No"]
[null,null,null,null,"",null,null,null,null,null,null,null,null,null,null,null,null,null,null,null,null,"IA012","No"]
[null,null,null,null,"",null,null,null,null,null,null,null,null,null,null,null,null,null,null,null,null,"IA013","No"]
[null,null,null,null,"",null,null,null,null,null,null,null,null,null,null,null,null,null,null,null,null,"IA014","No"]
[null,null,null,null,"",null,null,null,null,null,null,null,null,null,null,null,null,null,null,null,null,"IA015","No"]
[null,null,null,null,"",null,null,null,null,null,null,null,null,null,null,null,null,null,null,null,null,"IA016","No"]
[null,null,null,null,"",null,null,null,null,null,null,null,null,null,null,null,null,null,null,null,null,"IA017","Yes"]
[null,null,null,null,"",null,null,null,null,null,null,null,null,null,null,null,null,null,null,null,null,"IA019","No"]
[null,null,null,null,"",null,null,null,null,null,null,null,null,null,null,null,null,null,null,null,null,"IA020","No"]
[null,null,null,null,"",null,null,null,null,null,null,null,null,null,null,null,null,null,null,null,null,"IA021","No"]
[null,null,null,null,{"$f":"LEFT(F707,2)","v":""},null,null,null,null,null,null,null,null,null,null,null,null,null,null,null,null,"IA022","No"]
[null,null,null,null,"",null,null,null,null,null,null,null,null,null,null,null,null,null,null,null,null,"IA023","No"]
[null,null,null,null,"",null,null,null,null,null,null,null,null,null,null,null,null,null,null,null,null,"IA025","No"]
[null,null,null,null,"",null,null,null,null,null,null,null,null,null,null,null,null,null,null,null,null,"IA026","No"]
[null,null,null,null,"",null,null,null,null,null,null,null,null,null,null,null,null,null,null,null,null,"IA027","No"]
[null,null,null,null,"",null,null,null,null,null,null,null,null,null,null,null,null,null,null,null,null,"IA028","No"]
[null,null,null,null,"",null,null,null,null,null,null,null,null,null,null,null,null,null,null,null,null,"IA029","No"]
[null,null,null,null,"",null,null,null,null,null,null,null,null,null,null,null,null,null,null,null,null,"IA030","No"]
[null,null,null,null,"",null,null,null,null,null,null,null,null,null,null,null,null,null,null,null,null,"IA032","No"]
[null,null,null,null,"",null,null,null,null,null,null,null,null,null,null,null,null,null,null,null,null,"IA034","No"]
[null,null,null,null,"",null,null,null,null,null,null,null,null,null,null,null,null,null,null,null,null,"IA038","No"]
[null,null,null,null,"",null,null,null,null,null,null,null,null,null,null,null,null,null,null,null,null,"IA042","No"]
[null,null,null,null,"",null,null,null,null,null,null,null,null,null,null,null,null,null,null,null,null,"IA044","No"]
[null,null,null,null,"",null,null,null,null,null,null,null,null,null,null,null,null,null,null,null,null,"IA045","No"]
[null,null,null,null,"",null,null,null,null,null,null,null,null,null,null,null,null,null,null,null,null,"IA046","No"]
[null,null,null,null,"",null,null,null,null,null,null,null,null,null,null,null,null,null,null,null,null,"IA047","No"]
[null,null,null,null,"",null,null,null,null,null,null,null,null,null,null,null,null,null,null,null,null,"IA049","No"]
[null,null,null,null,"",null,null,null,null,null,null,null,null,null,null,null,null,null,null,null,null,"IA050","No"]
[null,null,null,null,"",null,null,null,null,null,null,null,null,null,null,null,null,null,null,null,null,"IA079","No"]
[null,null,null,null,"",null,null,null,null,null,null,null,null,null,null,null,null,null,null,null,null,"IA098","No"]
[null,null,null,null,"",null,null,null,null,null,null,null,null,null,null,null,null,null,null,null,null,"IA107","No"]
[null,null,null,null,"",null,null,null,null,null,null,null,null,null,null,null,null,null,null,null,null,"IA114","No"]
[null,null,null,null,"",null,null,null,null,null,null,null,null,null,null,null,null,null,null,null,null,"IA117","No"]
[null,null,null,null,"",null,null,null,null,null,null,null,null,null,null,null,null,null,null,null,null,"IA119","No"]
[null,null,null,null,"",null,null,null,null,null,null,null,null,null,null,null,null,null,null,null,null,"IA124","No"]
[null,null,null,null,"",null,null,null,null,null,null,null,null,null,null,null,null,null,null,null,null,"IA126","No"]
[null,null,null,null,"",null,null,null,null,null,null,null,null,null,null,null,null,null,null,null,null,"IA127","No"]
[null,null,null,null,"",null,null,null,null,null,null,null,null,null,null,null,null,null,null,null,null,"IA131","No"]
[null,null,null,null,"",null,null,null,null,null,null,null,null,null,null,null,null,null,null,null,null,"ID001","No"]
[null,null,null,null,"",null,null,null,null,null,null,null,null,null,null,null,null,null,null,null,null,"ID002","No"]
[null,null,null,null,"",null,null,null,null,null,null,null,null,null,null,null,null,null,null,null,null,"ID005","No"]
[null,null,null,null,"",null,null,null,null,null,null,null,null,null,null,null,null,null,null,null,null,"ID010","No"]
[null,null,null,null,"",null,null,null,null,null,null,null,null,null,null,null,null,null,null,null,null,"ID011","No"]
[null,null,null,null,"",null,null,null,null,null,null,null,null,null,null,null,null,null,null,null,null,"ID012","No"]
[null,null,null,null,"",null,null,null,null,null,null,null,null,null,null,null,null,null,null,null,null,"ID013","No"]
[null,null,null,null,"",null,null,null,null,null,null,null,null,null,null,null,null,null,null,null,null,"ID016","No"]
[null,null,null,null,"",null,null,null,null,null,null,null,null,null,null,null,null,null,null,null,null,"ID020","Yes"]
[null,null,null,null,"",null,null,null,null,null,null,null,null,null,null,null,null,null,null,null,null,"ID021","Yes"]
[null,null,null,null,"",null,null,null,null,null,null,null,null,null,null,null,null,null,null,null,null,"IL001","No"]
[null,null,null,null,"",null,null,null,null,null,null,null,null,null,null,null,null,null,null,null,null,"IL002","No"]
[null,null,null,null,"",null,null,null,null,null,null,null,null,null,null,null,null,null,null,null,null,"IL003","No"]
[null,null,null,null,"",null,null,null,null,null,null,null,null,null,null,null,null,null,null,null,null,"IL004","No"]
[null,null,null,null,"",null,null,null,null,null,null,null,null,null,null,null,null,null,null,null,null,"IL005","No"]
[null,null,null,null,"",null,null,null,null,null,null,null,null,null,null,null,null,null,null,null,null,"IL006","No"]
[null,null,null,null,"",null,null,null,null,null,null,null,null,null,null,null,null,null,null,null,null,"IL007","No"]
[null,null,null,null,"",null,null,null,null,null,null,null,null,null,null,null,null,null,null,null,null,"IL009","No"]
[null,null,null,null,"",null,null,null,null,null,null,null,null,null,null,null,null,null,null,null,null,"IL010","Yes"]
[null,null,null,null,"",null,null,null,null,null,null,null,null,null,null,null,null,null,null,null,null,"IL011","No"]
[null,null,null,null,"",null,null,null,null,null,null,null,null,null,null,null,null,null,null,null,null,"IL012","No"]
[null,null,null,null,"",null,null,null,null,null,null,null,null,null,null,null,null,null,null,null,null,"IL014","No"]
[null,null,null,null,"",null,null,null,null,null,null,null,null,null,null,null,null,null,null,null,null,"IL015","No"]
[null,null,null,null,"",null,null,null,null,null,null,null,null,null,null,null,null,null,null,null,null,"IL016","No"]
[null,null,null,null,"",null,null,null,null,null,null,null,null,null,null,null,null,null,null,null,null,"IL018","Yes"]
[null,null,null,null,"",null,null,null,null,null,null,null,null,null,null,null,null,null,null,null,null,"IL020","Yes"]
[null,null,null,null,"",null,null,null,null,null,null,null,null,null,null,null,null,null,null,null,null,"IL022","Yes"]
[null,null,null,null,"",null,null,null,null,null,null,null,null,null,null,null,null,null,null,null,null,"IL024","No"]
[null,null,null,null,"",null,null,null,null,null,null,null,null,null,null,null,null,null,null,null,null,"IL025","No"]
[null,null,null,null,"",null,null,null,null,null,null,null,null,null,null,null,null,null,null,null,null,"IL026","No"]
[null,null,null,null,"",null,null,null,null,null,null,null,null,null,null,null,null,null,null,null,null,"IL027","No"]
[null,null,null,null,"",null,null,null,null,null,null,null,null,null,null,null,null,null,null,null,null,"IL028","Yes"]
[null,null,null,null,"",null,null,null,null,null,null,null,null,null,null,null,null,null,null,null,null,"IL029","No"]
[null,null,null,null,"",null,null,null,null,null,null,null,null,null,null,null,null,null,null,null,null,"IL030","No"]
[null,null,null,null,"",null,null,null,null,null,null,null,null,null,null,null,null,null,null,null,null,"IL031","No"]
[null,null,null,null,"",null,null,null,null,null,null,null,null,null,null,null,null,null,null,null,null,"IL032","No"]
[null,null,null,null,{"$f":"LEFT(F771,2)","v":""},null,null,null,null,null,null,null,null,null,null,null,null,null,null,null,null,"IL034","No"]
[null,null,null,null,"",null,null,null,null,null,null,null,null,null,null,null,null,null,null,null,null,"IL035","No"]
[null,null,null,null,"",null,null,null,null,null,null,null,null,null,null,null,null,null,null,null,null,"IL036","No"]
[null,null,null,null,"",null,null,null,null,null,null,null,null,null,null,null,null,null,null,null,null,"IL037","No"]
[null,null,null,null,"",null,null,null,null,null,null,null,null,null,null,null,null,null,null,null,null,"IL038","No"]
[null,null,null,null,"",null,null,null,null,null,null,null,null,null,null,null,null,null,null,null,null,"IL039","No"]
[null,null,null,null,"",null,null,null,null,null,null,null,null,null,null,null,null,null,null,null,null,"IL040","No"]
[null,null,null,null,"",null,null,null,null,null,null,null,null,null,null,null,null,null,null,null,null,"IL041","No"]
[null,null,null,null,"",null,null,null,null,null,null,null,null,null,null,null,null,null,null,null,null,"IL042","No"]
[null,null,null,null,"",null,null,null,null,null,null,null,null,null,null,null,null,null,null,null,null,"IL043","No"]
[null,null,null,null,"",null,null,null,null,null,null,null,null,null,null,null,null,null,null,null,null,"IL044","No"]
[null,null,null,null,"",null,null,null,null,null,null,null,null,null,null,null,null,null,null,null,null,"IL045","No"]
[null,null,null,null,"",null,null,null,null,null,null,null,null,null,null,null,null,null,null,null,null,"IL046","No"]
[null,null,null,null,"",null,null,null,null,null,null,null,null,null,null,null,null,null,null,null,null,"IL047","No"]
[null,null,null,null,"",null,null,null,null,null,null,null,null,null,null,null,null,null,null,null,null,"IL048","No"]
[null,null,null,null,"",null,null,null,null,null,null,null,null,null,null,null,null,null,null,null,null,"IL049","Yes"]
[null,null,null,null,"",null,null,null,null,null,null,null,null,null,null,null,null,null,null,null,null,"IL050","No"]
[null,null,null,null,"",null,null,null,null,null,null,null,null,null,null,null,null,null,null,null,null,"IL051","No"]
[null,null,null,null,"",null,null,null,null,null,null,null,null,null,null,null,null,null,null,null,null,"IL052","No"]
[null,null,null,null,"",null,null,null,null,null,null,null,null,null,null,null,null,null,null,null,null,"IL053","Yes"]
[null,null,null,null,"",null,null,null,null,null,null,null,null,null,null,null,null,null,null,null,null,"IL055","No"]
[null,null,null,null,"",null,null,null,null,null,null,null,null,null,null,null,null,null,null,null,null,"IL056","No"]
[null,null,null,null,"",null,null,null,null,null,null,null,null,null,null,null,null,null,null,null,null,"IL057","No"]
[null,null,null,null,"",null,null,null,null,null,null,null,null,null,null,null,null,null,null,null,null,"IL058","No"]
[null,null,null,null,"",null,null,null,null,null,null,null,null,null,null,null,null,null,null,null,null,"IL059","No"]
[null,null,null,null,"",null,null,null,null,null,null,null,null,null,null,null,null,null,null,null,null,"IL060","No"]
[null,null,null,null,"",null,null,null,null,null,null,null,null,null,null,null,null,null,null,null,null,"IL061","No"]
[null,null,null,null,"",null,null,null,null,null,null,null,null,null,null,null,null,null,null,null,null,"IL062","No"]
[null,null,null,null,"",null,null,null,null,null,null,null,null,null,null,null,null,null,null,null,null,"IL063","No"]
[null,null,null,null,"",null,null,null,null,null,null,null,null,null,null,null,null,null,null,null,null,"IL065","No"]
[null,null,null,null,"",null,null,null,null,null,null,null,null,null,null,null,null,null,null,null,null,"IL066","No"]
[null,null,null,null,"",null,null,null,null,null,null,null,null,null,null,null,null,null,null,null,null,"IL067","No"]
[null,null,null,null,"",null,null,null,null,null,null,null,null,null,null,null,null,null,null,null,null,"IL068","No"]
[null,null,null,null,"",null,null,null,null,null,null,null,null,null,null,null,null,null,null,null,null,"IL069","No"]
[null,null,null,null,"",null,null,null,null,null,null,null,null,null,null,null,null,null,null,null,null,"IL070","No"]
[null,null,null,null,"",null,null,null,null,null,null,null,null,null,null,null,null,null,null,null,null,"IL071","No"]
[null,null,null,null,"",null,null,null,null,null,null,null,null,null,null,null,null,null,null,null,null,"IL072","No"]
[null,null,null,null,"",null,null,null,null,null,null,null,null,null,null,null,null,null,null,null,null,"IL073","No"]
[null,null,null,null,"",null,null,null,null,null,null,null,null,null,null,null,null,null,null,null,null,"IL074","No"]
[null,null,null,null,"",null,null,null,null,null,null,null,null,null,null,null,null,null,null,null,null,"IL076","No"]
[null,null,null,null,"",null,null,null,null,null,null,null,null,null,null,null,null,null,null,null,null,"IL078","No"]
[null,null,null,null,"",null,null,null,null,null,null,null,null,null,null,null,null,null,null,null,null,"IL079","No"]
[null,null,null,null,"",null,null,null,null,null,null,null,null,null,null,null,null,null,null,null,null,"IL080","No"]
[null,null,null,null,"",null,null,null,null,null,null,null,null,null,null,null,null,null,null,null,null,"IL081","Yes"]
[null,null,null,null,"",null,null,null,null,null,null,null,null,null,null,null,null,null,null,null,null,"IL082","No"]
[null,null,null,null,"",null,null,null,null,null,null,null,null,null,null,null,null,null,null,null,null,"IL083","No"]
[null,null,null,null,"",null,null,null,null,null,null,null,null,null,null,null,null,null,null,null,null,"IL084","No"]
[null,null,null,null,"",null,null,null,null,null,null,null,null,null,null,null,null,null,null,null,null,"IL085","No"]
[null,null,null,null,"",null,null,null,null,null,null,null,null,null,null,null,null,null,null,null,null,"IL086","No"]
[null,null,null,null,"",null,null,null,null,null,null,null,null,null,null,null,null,null,null,null,null,"IL087","No"]
[null,null,null,null,"",null,null,null,null,null,null,null,null,null,null,null,null,null,null,null,null,"IL088","No"]
[null,null,null,null,"",null,null,null,null,null,null,null,null,null,null,null,null,null,null,null,null,"IL089","No"]
[null,null,null,null,"",null,null,null,null,null,null,null,null,null,null,null,null,null,null,null,null,"IL090","No"]
[null,null,null,null,"",null,null,null,null,null,null,null,null,null,null,null,null,null,null,null,null,"IL091","No"]
[null,null,null,null,"",null,null,null,null,null,null,null,null,null,null,null,null,null,null,null,null,"IL092","No"]
[null,null,null,null,"",null,null,null,null,null,null,null,null,null,null,null,null,null,null,null,null,"IL093","No"]
[null,null,null,null,"",null,null,null,null,null,null,null,null,null,null,null,null,null,null,null,null,"IL094","No"]
[null,null,null,null,"",null,null,null,null,null,null,null,null,null,null,null,null,null,null,null,null,"IL095","No"]
[null,null,null,null,"",null,null,null,null,null,null,null,null,null,null,null,null,null,null,null,null,"IL096","No"]
[null,null,null,null,"",null,null,null,null,null,null,null,null,null,null,null,null,null,null,null,null,"IL097","No"]
[null,null,null,null,"",null,null,null,null,null,null,null,null,null,null,null,null,null,null,null,null,"IL099","No"]
[null,null,null,null,"",null,null,null,null,null,null,null,null,null,null,null,null,null,null,null,null,"IL100","No"]
[null,null,null,null,"",null,null,null,null,null,null,null,null,null,null,null,null,null,null,null,null,"IL102","No"]
[null,null,null,null,"",null,null,null,null,null,null,null,null,null,null,null,null,null,null,null,null,"IL103","No"]
[null,null,null,null,{"$f":"LEFT(F835,2)","v":""},null,null,null,null,null,null,null,null,null,null,null,null,null,null,null,null,"IL104","No"]
[null,null,null,null,"",null,null,null,null,null,null,null,null,null,null,null,null,null,null,null,null,"IL107","No"]
[null,null,null,null,"",null,null,null,null,null,null,null,null,null,null,null,null,null,null,null,null,"IL108","No"]
[null,null,null,null,"",null,null,null,null,null,null,null,null,null,null,null,null,null,null,null,null,"IL116","No"]
[null,null,null,null,"",null,null,null,null,null,null,null,null,null,null,null,null,null,null,null,null,"IL118","No"]
[null,null,null,null,"",null,null,null,null,null,null,null,null,null,null,null,null,null,null,null,null,"IL120","No"]
[null,null,null,null,"",null,null,null,null,null,null,null,null,null,null,null,null,null,null,null,null,"IL126","No"]
[null,null,null,null,"",null,null,null,null,null,null,null,null,null,null,null,null,null,null,null,null,"IL128","No"]
[null,null,null,null,"",null,null,null,null,null,null,null,null,null,null,null,null,null,null,null,null,"IL131","Yes"]
[null,null,null,null,"",null,null,null,null,null,null,null,null,null,null,null,null,null,null,null,null,"IN002","No"]
[null,null,null,null,"",null,null,null,null,null,null,null,null,null,null,null,null,null,null,null,null,"IN003","No"]
[null,null,null,null,"",null,null,null,null,null,null,null,null,null,null,null,null,null,null,null,null,"IN004","No"]
[null,null,null,null,"",null,null,null,null,null,null,null,null,null,null,null,null,null,null,null,null,"IN005","Yes"]
[null,null,null,null,"",null,null,null,null,null,null,null,null,null,null,null,null,null,null,null,null,"IN006","No"]
[null,null,null,null,"",null,null,null,null,null,null,null,null,null,null,null,null,null,null,null,null,"IN007","Yes"]
[null,null,null,null,"",null,null,null,null,null,null,null,null,null,null,null,null,null,null,null,null,"IN009","No"]
[null,null,null,null,"",null,null,null,null,null,null,null,null,null,null,null,null,null,null,null,null,"IN010","No"]
[null,null,null,null,"",null,null,null,null,null,null,null,null,null,null,null,null,null,null,null,null,"IN011","No"]
[null,null,null,null,"",null,null,null,null,null,null,null,null,null,null,null,null,null,null,null,null,"IN012","No"]
[null,null,null,null,"",null,null,null,null,null,null,null,null,null,null,null,null,null,null,null,null,"IN015","Yes"]
[null,null,null,null,"",null,null,null,null,null,null,null,null,null,null,null,null,null,null,null,null,"IN016","No"]
[null,null,null,null,"",null,null,null,null,null,null,null,null,null,null,null,null,null,null,null,null,"IN017","No"]
[null,null,null,null,"",null,null,null,null,null,null,null,null,null,null,null,null,null,null,null,null,"IN018","No"]
[null,null,null,null,"",null,null,null,null,null,null,null,null,null,null,null,null,null,null,null,null,"IN019","No"]
[null,null,null,null,"",null,null,null,null,null,null,null,null,null,null,null,null,null,null,null,null,"IN020","No"]
[null,null,null,null,"",null,null,null,null,null,null,null,null,null,null,null,null,null,null,null,null,"IN021","No"]
[null,null,null,null,"",null,null,null,null,null,null,null,null,null,null,null,null,null,null,null,null,"IN022","No"]
[null,null,null,null,"",null,null,null,null,null,null,null,null,null,null,null,null,null,null,null,null,"IN023","No"]
[null,null,null,null,"",null,null,null,null,null,null,null,null,null,null,null,null,null,null,null,null,"IN024","No"]
[null,null,null,null,"",null,null,null,null,null,null,null,null,null,null,null,null,null,null,null,null,"IN025","No"]
[null,null,null,null,"",null,null,null,null,null,null,null,null,null,null,null,null,null,null,null,null,"IN026","No"]
[null,null,null,null,"",null,null,null,null,null,null,null,null,null,null,null,null,null,null,null,null,"IN028","No"]
[null,null,null,null,"",null,null,null,null,null,null,null,null,null,null,null,null,null,null,null,null,"IN029","No"]
[null,null,null,null,"",null,null,null,null,null,null,null,null,null,null,null,null,null,null,null,null,"IN030","No"]
[null,null,null,null,"",null,null,null,null,null,null,null,null,null,null,null,null,null,null,null,null,"IN031","No"]
[null,null,null,null,"",null,null,null,null,null,null,null,null,null,null,null,null,null,null,null,null,"IN032","No"]
[null,null,null,null,"",null,null,null,null,null,null,null,null,null,null,null,null,null,null,null,null,"IN034","No"]
[null,null,null,null,"",null,null,null,null,null,null,null,null,null,null,null,null,null,null,null,null,"IN035","No"]
[null,null,null,null,"",null,null,null,null,null,null,null,null,null,null,null,null,null,null,null,null,"IN036","No"]
[null,null,null,null,"",null,null,null,null,null,null,null,null,null,null,null,null,null,null,null,null,"IN037","No"]
[null,null,null,null,"",null,null,null,null,null,null,null,null,null,null,null,null,null,null,null,null,"IN039","No"]
[null,null,null,null,"",null,null,null,null,null,null,null,null,null,null,null,null,null,null,null,null,"IN041","No"]
[null,null,null,null,"",null,null,null,null,null,null,null,null,null,null,null,null,null,null,null,null,"IN050","No"]
[null,null,null,null,"",null,null,null,null,null,null,null,null,null,null,null,null,null,null,null,null,"IN055","No"]
[null,null,null,null,"",null,null,null,null,null,null,null,null,null,null,null,null,null,null,null,null,"IN058","No"]
[null,null,null,null,"",null,null,null,null,null,null,null,null,null,null,null,null,null,null,null,null,"IN067","No"]
[null,null,null,null,"",null,null,null,null,null,null,null,null,null,null,null,null,null,null,null,null,"IN085","No"]
[null,null,null,null,"",null,null,null,null,null,null,null,null,null,null,null,null,null,null,null,null,"IN089","No"]
[null,null,null,null,"",null,null,null,null,null,null,null,null,null,null,null,null,null,null,null,null,"IN090","No"]
[null,null,null,null,"",null,null,null,null,null,null,null,null,null,null,null,null,null,null,null,null,"IN091","No"]
[null,null,null,null,"",null,null,null,null,null,null,null,null,null,null,null,null,null,null,null,null,"KS001","No"]
[null,null,null,null,"",null,null,null,null,null,null,null,null,null,null,null,null,null,null,null,null,"KS002","No"]
[null,null,null,null,"",null,null,null,null,null,null,null,null,null,null,null,null,null,null,null,null,"KS003","No"]
[null,null,null,null,"",null,null,null,null,null,null,null,null,null,null,null,null,null,null,null,null,"KS004","No"]
[null,null,null,null,"",null,null,null,null,null,null,null,null,null,null,null,null,null,null,null,null,"KS005","No"]
[null,null,null,null,"",null,null,null,null,null,null,null,null,null,null,null,null,null,null,null,null,"KS006","No"]
[null,null,null,null,"",null,null,null,null,null,null,null,null,null,null,null,null,null,null,null,null,"KS007","No"]
[null,null,null,null,"",null,null,null,null,null,null,null,null,null,null,null,null,null,null,null,null,"KS008","No"]
[null,null,null,null,"",null,null,null,null,null,null,null,null,null,null,null,null,null,null,null,null,"KS009","No"]
[null,null,null,null,"",null,null,null,null,null,null,null,null,null,null,null,null,null,null,null,null,"KS010","No"]
[null,null,null,null,"",null,null,null,null,null,null,null,null,null,null,null,null,null,null,null,null,"KS011","No"]
[null,null,null,null,"",null,null,null,null,null,null,null,null,null,null,null,null,null,null,null,null,"KS012","No"]
[null,null,null,null,"",null,null,null,null,null,null,null,null,null,null,null,null,null,null,null,null,"KS013","No"]
[null,null,null,null,"",null,null,null,null,null,null,null,null,null,null,null,null,null,null,null,null,"KS014","No"]
[null,null,null,null,{"$f":"LEFT(F899,2)","v":""},null,null,null,null,null,null,null,null,null,null,null,null,null,null,null,null,"KS015","Yes"]
[null,null,null,null,"",null,null,null,null,null,null,null,null,null,null,null,null,null,null,null,null,"KS016","No"]
[null,null,null,null,"",null,null,null,null,null,null,null,null,null,null,null,null,null,null,null,null,"KS017","No"]
[null,null,null,null,"",null,null,null,null,null,null,null,null,null,null,null,null,null,null,null,null,"KS018","No"]
[null,null,null,null,"",null,null,null,null,null,null,null,null,null,null,null,null,null,null,null,null,"KS019","No"]
[null,null,null,null,"",null,null,null,null,null,null,null,null,null,null,null,null,null,null,null,null,"KS020","No"]
[null,null,null,null,"",null,null,null,null,null,null,null,null,null,null,null,null,null,null,null,null,"KS021","No"]
[null,null,null,null,"",null,null,null,null,null,null,null,null,null,null,null,null,null,null,null,null,"KS022","No"]
[null,null,null,null,"",null,null,null,null,null,null,null,null,null,null,null,null,null,null,null,null,"KS023","No"]
[null,null,null,null,"",null,null,null,null,null,null,null,null,null,null,null,null,null,null,null,null,"KS025","No"]
[null,null,null,null,"",null,null,null,null,null,null,null,null,null,null,null,null,null,null,null,null,"KS026","No"]
[null,null,null,null,"",null,null,null,null,null,null,null,null,null,null,null,null,null,null,null,null,"KS027","No"]
[null,null,null,null,"",null,null,null,null,null,null,null,null,null,null,null,null,null,null,null,null,"KS028","No"]
[null,null,null,null,"",null,null,null,null,null,null,null,null,null,null,null,null,null,null,null,null,"KS029","No"]
[null,null,null,null,"",null,null,null,null,null,null,null,null,null,null,null,null,null,null,null,null,"KS030","No"]
[null,null,null,null,"",null,null,null,null,null,null,null,null,null,null,null,null,null,null,null,null,"KS031","No"]
[null,null,null,null,"",null,null,null,null,null,null,null,null,null,null,null,null,null,null,null,null,"KS032","No"]
[null,null,null,null,"",null,null,null,null,null,null,null,null,null,null,null,null,null,null,null,null,"KS033","No"]
[null,null,null,null,"",null,null,null,null,null,null,null,null,null,null,null,null,null,null,null,null,"KS034","No"]
[null,null,null,null,"",null,null,null,null,null,null,null,null,null,null,null,null,null,null,null,null,"KS036","No"]
[null,null,null,null,"",null,null,null,null,null,null,null,null,null,null,null,null,null,null,null,null,"KS037","No"]
[null,null,null,null,"",null,null,null,null,null,null,null,null,null,null,null,null,null,null,null,null,"KS038","No"]
[null,null,null,null,"",null,null,null,null,null,null,null,null,null,null,null,null,null,null,null,null,"KS039","No"]
[null,null,null,null,"",null,null,null,null,null,null,null,null,null,null,null,null,null,null,null,null,"KS040","No"]
[null,null,null,null,"",null,null,null,null,null,null,null,null,null,null,null,null,null,null,null,null,"KS041","No"]
[null,null,null,null,"",null,null,null,null,null,null,null,null,null,null,null,null,null,null,null,null,"KS042","No"]
[null,null,null,null,"",null,null,null,null,null,null,null,null,null,null,null,null,null,null,null,null,"KS043","No"]
[null,null,null,null,"",null,null,null,null,null,null,null,null,null,null,null,null,null,null,null,null,"KS044","No"]
[null,null,null,null,"",null,null,null,null,null,null,null,null,null,null,null,null,null,null,null,null,"KS045","No"]
[null,null,null,null,"",null,null,null,null,null,null,null,null,null,null,null,null,null,null,null,null,"KS047","No"]
[null,null,null,null,"",null,null,null,null,null,null,null,null,null,null,null,null,null,null,null,null,"KS049","No"]
[null,null,null,null,"",null,null,null,null,null,null,null,null,null,null,null,null,null,null,null,null,"KS050","No"]
[null,null,null,null,"",null,null,null,null,null,null,null,null,null,null,null,null,null,null,null,null,"KS051","Yes"]
[null,null,null,null,"",null,null,null,null,null,null,null,null,null,null,null,null,null,null,null,null,"KS052","No"]
[null,null,null,null,"",null,null,null,null,null,null,null,null,null,null,null,null,null,null,null,null,"KS053","No"]
[null,null,null,null,"",null,null,null,null,null,null,null,null,null,null,null,null,null,null,null,null,"KS054","No"]
[null,null,null,null,"",null,null,null,null,null,null,null,null,null,null,null,null,null,null,null,null,"KS055","No"]
[null,null,null,null,"",null,null,null,null,null,null,null,null,null,null,null,null,null,null,null,null,"KS056","No"]
[null,null,null,null,"",null,null,null,null,null,null,null,null,null,null,null,null,null,null,null,null,"KS057","No"]
[null,null,null,null,"",null,null,null,null,null,null,null,null,null,null,null,null,null,null,null,null,"KS058","No"]
[null,null,null,null,"",null,null,null,null,null,null,null,null,null,null,null,null,null,null,null,null,"KS059","No"]
[null,null,null,null,"",null,null,null,null,null,null,null,null,null,null,null,null,null,null,null,null,"KS060","No"]
[null,null,null,null,"",null,null,null,null,null,null,null,null,null,null,null,null,null,null,null,null,"KS061","No"]
[null,null,null,null,"",null,null,null,null,null,null,null,null,null,null,null,null,null,null,null,null,"KS062","No"]
[null,null,null,null,"",null,null,null,null,null,null,null,null,null,null,null,null,null,null,null,null,"KS063","No"]
[null,null,null,null,"",null,null,null,null,null,null,null,null,null,null,null,null,null,null,null,null,"KS065","No"]
[null,null,null,null,"",null,null,null,null,null,null,null,null,null,null,null,null,null,null,null,null,"KS066","No"]
[null,null,null,null,"",null,null,null,null,null,null,null,null,null,null,null,null,null,null,null,null,"KS068","No"]
[null,null,null,null,"",null,null,null,null,null,null,null,null,null,null,null,null,null,null,null,null,"KS069","No"]
[null,null,null,null,"",null,null,null,null,null,null,null,null,null,null,null,null,null,null,null,null,"KS070","No"]
[null,null,null,null,"",null,null,null,null,null,null,null,null,null,null,null,null,null,null,null,null,"KS071","No"]
[null,null,null,null,"",null,null,null,null,null,null,null,null,null,null,null,null,null,null,null,null,"KS072","No"]
[null,null,null,null,"",null,null,null,null,null,null,null,null,null,null,null,null,null,null,null,null,"KS073","No"]
[null,null,null,null,"",null,null,null,null,null,null,null,null,null,null,null,null,null,null,null,null,"KS076","No"]
[null,null,null,null,"",null,null,null,null,null,null,null,null,null,null,null,null,null,null,null,null,"KS077","No"]
[null,null,null,null,"",null,null,null,null,null,null,null,null,null,null,null,null,null,null,null,null,"KS078","No"]
[null,null,null,null,"",null,null,null,null,null,null,null,null,null,null,null,null,null,null,null,null,"KS079","No"]
[null,null,null,null,"",null,null,null,null,null,null,null,null,null,null,null,null,null,null,null,null,"KS080","No"]
[null,null,null,null,"",null,null,null,null,null,null,null,null,null,null,null,null,null,null,null,null,"KS081","No"]
[null,null,null,null,"",null,null,null,null,null,null,null,null,null,null,null,null,null,null,null,null,"KS082","No"]
[null,null,null,null,"",null,null,null,null,null,null,null,null,null,null,null,null,null,null,null,null,"KS083","No"]
[null,null,null,null,"",null,null,null,null,null,null,null,null,null,null,null,null,null,null,null,null,"KS086","No"]
[null,null,null,null,"",null,null,null,null,null,null,null,null,null,null,null,null,null,null,null,null,"KS091","No"]
[null,null,null,null,"",null,null,null,null,null,null,null,null,null,null,null,null,null,null,null,null,"KS094","No"]
[null,null,null,null,{"$f":"LEFT(F963,2)","v":""},null,null,null,null,null,null,null,null,null,null,null,null,null,null,null,null,"KS095","No"]
[null,null,null,null,"",null,null,null,null,null,null,null,null,null,null,null,null,null,null,null,null,"KS096","No"]
[null,null,null,null,"",null,null,null,null,null,null,null,null,null,null,null,null,null,null,null,null,"KS100","No"]
[null,null,null,null,"",null,null,null,null,null,null,null,null,null,null,null,null,null,null,null,null,"KS105","No"]
[null,null,null,null,"",null,null,null,null,null,null,null,null,null,null,null,null,null,null,null,null,"KS112","No"]
[null,null,null,null,"",null,null,null,null,null,null,null,null,null,null,null,null,null,null,null,null,"KS113","No"]
[null,null,null,null,"",null,null,null,null,null,null,null,null,null,null,null,null,null,null,null,null,"KS121","No"]
[null,null,null,null,"",null,null,null,null,null,null,null,null,null,null,null,null,null,null,null,null,"KS131","No"]
[null,null,null,null,"",null,null,null,null,null,null,null,null,null,null,null,null,null,null,null,null,"KS132","No"]
[null,null,null,null,"",null,null,null,null,null,null,null,null,null,null,null,null,null,null,null,null,"KS141","No"]
[null,null,null,null,"",null,null,null,null,null,null,null,null,null,null,null,null,null,null,null,null,"KS142","No"]
[null,null,null,null,"",null,null,null,null,null,null,null,null,null,null,null,null,null,null,null,null,"KS143","No"]
[null,null,null,null,"",null,null,null,null,null,null,null,null,null,null,null,null,null,null,null,null,"KS147","No"]
[null,null,null,null,"",null,null,null,null,null,null,null,null,null,null,null,null,null,null,null,null,"KS152","No"]
[null,null,null,null,"",null,null,null,null,null,null,null,null,null,null,null,null,null,null,null,null,"KS155","No"]
[null,null,null,null,"",null,null,null,null,null,null,null,null,null,null,null,null,null,null,null,null,"KS158","No"]
[null,null,null,null,"",null,null,null,null,null,null,null,null,null,null,null,null,null,null,null,null,"KY001","No"]
[null,null,null,null,"",null,null,null,null,null,null,null,null,null,null,null,null,null,null,null,null,"KY002","Yes"]
[null,null,null,null,"",null,null,null,null,null,null,null,null,null,null,null,null,null,null,null,null,"KY003","Yes"]
[null,null,null,null,"",null,null,null,null,null,null,null,null,null,null,null,null,null,null,null,null,"KY004","No"]
[null,null,null,null,"",null,null,null,null,null,null,null,null,null,null,null,null,null,null,null,null,"KY006","No"]
[null,null,null,null,"",null,null,null,null,null,null,null,null,null,null,null,null,null,null,null,null,"KY007","No"]
[null,null,null,null,"",null,null,null,null,null,null,null,null,null,null,null,null,null,null,null,null,"KY008","No"]
[null,null,null,null,"",null,null,null,null,null,null,null,null,null,null,null,null,null,null,null,null,"KY009","No"]
[null,null,null,null,"",null,null,null,null,null,null,null,null,null,null,null,null,null,null,null,null,"KY010","Yes"]
[null,null,null,null,"",null,null,null,null,null,null,null,null,null,null,null,null,null,null,null,null,"KY011","No"]
[null,null,null,null,"",null,null,null,null,null,null,null,null,null,null,null,null,null,null,null,null,"KY012","No"]
[null,null,null,null,"",null,null,null,null,null,null,null,null,null,null,null,null,null,null,null,null,"KY013","No"]
[null,null,null,null,"",null,null,null,null,null,null,null,null,null,null,null,null,null,null,null,null,"KY014","No"]
[null,null,null,null,"",null,null,null,null,null,null,null,null,null,null,null,null,null,null,null,null,"KY015","No"]
[null,null,null,null,"",null,null,null,null,null,null,null,null,null,null,null,null,null,null,null,null,"KY016","No"]
[null,null,null,null,"",null,null,null,null,null,null,null,null,null,null,null,null,null,null,null,null,"KY017","No"]
[null,null,null,null,"",null,null,null,null,null,null,null,null,null,null,null,null,null,null,null,null,"KY018","No"]
[null,null,null,null,"",null,null,null,null,null,null,null,null,null,null,null,null,null,null,null,null,"KY019","No"]
[null,null,null,null,"",null,null,null,null,null,null,null,null,null,null,null,null,null,null,null,null,"KY020","No"]
[null,null,null,null,"",null,null,null,null,null,null,null,null,null,null,null,null,null,null,null,null,"KY021","No"]
[null,null,null,null,"",null,null,null,null,null,null,null,null,null,null,null,null,null,null,null,null,"KY022","No"]
[null,null,null,null,"",null,null,null,null,null,null,null,null,null,null,null,null,null,null,null,null,"KY023","No"]
[null,null,null,null,"",null,null,null,null,null,null,null,null,null,null,null,null,null,null,null,null,"KY024","Yes"]
[null,null,null,null,"",null,null,null,null,null,null,null,null,null,null,null,null,null,null,null,null,"KY025","No"]
[null,null,null,null,"",null,null,null,null,null,null,null,null,null,null,null,null,null,null,null,null,"KY026","No"]
[null,null,null,null,"",null,null,null,null,null,null,null,null,null,null,null,null,null,null,null,null,"KY027","No"]
[null,null,null,null,"",null,null,null,null,null,null,null,null,null,null,null,null,null,null,null,null,"KY028","No"]
[null,null,null,null,"",null,null,null,null,null,null,null,null,null,null,null,null,null,null,null,null,"KY029","No"]
[null,null,null,null,"",null,null,null,null,null,null,null,null,null,null,null,null,null,null,null,null,"KY030","No"]
[null,null,null,null,"",null,null,null,null,null,null,null,null,null,null,null,null,null,null,null,null,"KY031","No"]
[null,null,null,null,"",null,null,null,null,null,null,null,null,null,null,null,null,null,null,null,null,"KY032","No"]
[null,null,null,null,"",null,null,null,null,null,null,null,null,null,null,null,null,null,null,null,null,"KY033","No"]
[null,null,null,null,"",null,null,null,null,null,null,null,null,null,null,null,null,null,null,null,null,"KY034","No"]
[null,null,null,null,"",null,null,null,null,null,null,null,null,null,null,null,null,null,null,null,null,"KY035","No"]
[null,null,null,null,"",null,null,null,null,null,null,null,null,null,null,null,null,null,null,null,null,"KY036","No"]
[null,null,null,null,"",null,null,null,null,null,null,null,null,null,null,null,null,null,null,null,null,"KY037","No"]
[null,null,null,null,"",null,null,null,null,null,null,null,null,null,null,null,null,null,null,null,null,"KY038","Yes"]
[null,null,null,null,"",null,null,null,null,null,null,null,null,null,null,null,null,null,null,null,null,"KY039","No"]
[null,null,null,null,"",null,null,null,null,null,null,null,null,null,null,null,null,null,null,null,null,"KY040","No"]
[null,null,null,null,"",null,null,null,null,null,null,null,null,null,null,null,null,null,null,null,null,"KY041","No"]
[null,null,null,null,"",null,null,null,null,null,null,null,null,null,null,null,null,null,null,null,null,"KY042","No"]
[null,null,null,null,"",null,null,null,null,null,null,null,null,null,null,null,null,null,null,null,null,"KY043","No"]
[null,null,null,null,"",null,null,null,null,null,null,null,null,null,null,null,null,null,null,null,null,"KY044","No"]
[null,null,null,null,"",null,null,null,null,null,null,null,null,null,null,null,null,null,null,null,null,"KY045","No"]
[null,null,null,null,"",null,null,null,null,null,null,null,null,null,null,null,null,null,null,null,null,"KY046","No"]
[null,null,null,null,"",null,null,null,null,null,null,null,null,null,null,null,null,null,null,null,null,"KY047","No"]
[null,null,null,null,"",null,null,null,null,null,null,null,null,null,null,null,null,null,null,null,null,"KY048","No"]
[null,null,null,null,"",null,null,null,null,null,null,null,null,null,null,null,null,null,null,null,null,"KY049","No"]
[null,null,null,null,{"$f":"LEFT(F1027,2)","v":""},null,null,null,null,null,null,null,null,null,null,null,null,null,null,null,null,"KY050","No"]
[null,null,null,null,"",null,null,null,null,null,null,null,null,null,null,null,null,null,null,null,null,"KY052","No"]
[null,null,null,null,"",null,null,null,null,null,null,null,null,null,null,null,null,null,null,null,null,"KY053","No"]
[null,null,null,null,"",null,null,null,null,null,null,null,null,null,null,null,null,null,null,null,null,"KY054","No"]
[null,null,null,null,"",null,null,null,null,null,null,null,null,null,null,null,null,null,null,null,null,"KY055","No"]
[null,null,null,null,"",null,null,null,null,null,null,null,null,null,null,null,null,null,null,null,null,"KY056","No"]
[null,null,null,null,"",null,null,null,null,null,null,null,null,null,null,null,null,null,null,null,null,"KY057","No"]
[null,null,null,null,"",null,null,null,null,null,null,null,null,null,null,null,null,null,null,null,null,"KY058","No"]
[null,null,null,null,"",null,null,null,null,null,null,null,null,null,null,null,null,null,null,null,null,"KY059","No"]
[null,null,null,null,"",null,null,null,null,null,null,null,null,null,null,null,null,null,null,null,null,"KY060","No"]
[null,null,null,null,"",null,null,null,null,null,null,null,null,null,null,null,null,null,null,null,null,"KY061","Yes"]
[null,null,null,null,"",null,null,null,null,null,null,null,null,null,null,null,null,null,null,null,null,"KY062","No"]
[null,null,null,null,"",null,null,null,null,null,null,null,null,null,null,null,null,null,null,null,null,"KY063","No"]
[null,null,null,null,"",null,null,null,null,null,null,null,null,null,null,null,null,null,null,null,null,"KY064","No"]
[null,null,null,null,"",null,null,null,null,null,null,null,null,null,null,null,null,null,null,null,null,"KY065","Yes"]
[null,null,null,null,"",null,null,null,null,null,null,null,null,null,null,null,null,null,null,null,null,"KY066","No"]
[null,null,null,null,"",null,null,null,null,null,null,null,null,null,null,null,null,null,null,null,null,"KY067","No"]
[null,null,null,null,"",null,null,null,null,null,null,null,null,null,null,null,null,null,null,null,null,"KY069","No"]
[null,null,null,null,"",null,null,null,null,null,null,null,null,null,null,null,null,null,null,null,null,"KY070","No"]
[null,null,null,null,"",null,null,null,null,null,null,null,null,null,null,null,null,null,null,null,null,"KY071","No"]
[null,null,null,null,"",null,null,null,null,null,null,null,null,null,null,null,null,null,null,null,null,"KY072","No"]
[null,null,null,null,"",null,null,null,null,null,null,null,null,null,null,null,null,null,null,null,null,"KY073","No"]
[null,null,null,null,"",null,null,null,null,null,null,null,null,null,null,null,null,null,null,null,null,"KY074","No"]
[null,null,null,null,"",null,null,null,null,null,null,null,null,null,null,null,null,null,null,null,null,"KY075","No"]
[null,null,null,null,"",null,null,null,null,null,null,null,null,null,null,null,null,null,null,null,null,"KY077","No"]
[null,null,null,null,"",null,null,null,null,null,null,null,null,null,null,null,null,null,null,null,null,"KY078","No"]
[null,null,null,null,"",null,null,null,null,null,null,null,null,null,null,null,null,null,null,null,null,"KY079","No"]
[null,null,null,null,"",null,null,null,null,null,null,null,null,null,null,null,null,null,null,null,null,"KY080","No"]
[null,null,null,null,"",null,null,null,null,null,null,null,null,null,null,null,null,null,null,null,null,"KY081","No"]
[null,null,null,null,"",null,null,null,null,null,null,null,null,null,null,null,null,null,null,null,null,"KY083","No"]
[null,null,null,null,"",null,null,null,null,null,null,null,null,null,null,null,null,null,null,null,null,"KY084","No"]
[null,null,null,null,"",null,null,null,null,null,null,null,null,null,null,null,null,null,null,null,null,"KY085","No"]
[null,null,null,null,"",null,null,null,null,null,null,null,null,null,null,null,null,null,null,null,null,"KY086","No"]
[null,null,null,null,"",null,null,null,null,null,null,null,null,null,null,null,null,null,null,null,null,"KY087","No"]
[null,null,null,null,"",null,null,null,null,null,null,null,null,null,null,null,null,null,null,null,null,"KY089","No"]
[null,null,null,null,"",null,null,null,null,null,null,null,null,null,null,null,null,null,null,null,null,"KY090","No"]
[null,null,null,null,"",null,null,null,null,null,null,null,null,null,null,null,null,null,null,null,null,"KY091","No"]
[null,null,null,null,"",null,null,null,null,null,null,null,null,null,null,null,null,null,null,null,null,"KY092","No"]
[null,null,null,null,"",null,null,null,null,null,null,null,null,null,null,null,null,null,null,null,null,"KY093","No"]
[null,null,null,null,"",null,null,null,null,null,null,null,null,null,null,null,null,null,null,null,null,"KY094","No"]
[null,null,null,null,"",null,null,null,null,null,null,null,null,null,null,null,null,null,null,null,null,"KY096","No"]
[null,null,null,null,"",null,null,null,null,null,null,null,null,null,null,null,null,null,null,null,null,"KY097","No"]
[null,null,null,null,"",null,null,null,null,null,null,null,null,null,null,null,null,null,null,null,null,"KY098","No"]
[null,null,null,null,"",null,null,null,null,null,null,null,null,null,null,null,null,null,null,null,null,"KY099","No"]
[null,null,null,null,"",null,null,null,null,null,null,null,null,null,null,null,null,null,null,null,null,"KY100","No"]
[null,null,null,null,"",null,null,null,null,null,null,null,null,null,null,null,null,null,null,null,null,"KY101","No"]
[null,null,null,null,"",null,null,null,null,null,null,null,null,null,null,null,null,null,null,null,null,"KY104","No"]
[null,null,null,null,"",null,null,null,null,null,null,null,null,null,null,null,null,null,null,null,null,"KY105","No"]
[null,null,null,null,"",null,null,null,null,null,null,null,null,null,null,null,null,null,null,null,null,"KY106","No"]
[null,null,null,null,"",null,null,null,null,null,null,null,null,null,null,null,null,null,null,null,null,"KY107","No"]
[null,null,null,null,"",null,null,null,null,null,null,null,null,null,null,null,null,null,null,null,null,"KY122","No"]
[null,null,null,null,"",null,null,null,null,null,null,null,null,null,null,null,null,null,null,null,null,"KY129","No"]
[null,null,null,null,"",null,null,null,null,null,null,null,null,null,null,null,null,null,null,null,null,"KY147","No"]
[null,null,null,null,"",null,null,null,null,null,null,null,null,null,null,null,null,null,null,null,null,"KY149","No"]
[null,null,null,null,"",null,null,null,null,null,null,null,null,null,null,null,null,null,null,null,null,"KY157","No"]
[null,null,null,null,"",null,null,null,null,null,null,null,null,null,null,null,null,null,null,null,null,"KY158","No"]
[null,null,null,null,"",null,null,null,null,null,null,null,null,null,null,null,null,null,null,null,null,"KY170","No"]
[null,null,null,null,"",null,null,null,null,null,null,null,null,null,null,null,null,null,null,null,null,"KY177","No"]
[null,null,null,null,"",null,null,null,null,null,null,null,null,null,null,null,null,null,null,null,null,"LA001","Yes"]
[null,null,null,null,"",null,null,null,null,null,null,null,null,null,null,null,null,null,null,null,null,"LA002","No"]
[null,null,null,null,"",null,null,null,null,null,null,null,null,null,null,null,null,null,null,null,null,"LA003","No"]
[null,null,null,null,"",null,null,null,null,null,null,null,null,null,null,null,null,null,null,null,null,"LA004","No"]
[null,null,null,null,"",null,null,null,null,null,null,null,null,null,null,null,null,null,null,null,null,"LA005","No"]
[null,null,null,null,"",null,null,null,null,null,null,null,null,null,null,null,null,null,null,null,null,"LA006","No"]
[null,null,null,null,{"$f":"LEFT(F1091,2)","v":""},null,null,null,null,null,null,null,null,null,null,null,null,null,null,null,null,"LA011","No"]
[null,null,null,null,"",null,null,null,null,null,null,null,null,null,null,null,null,null,null,null,null,"LA012","No"]
[null,null,null,null,"",null,null,null,null,null,null,null,null,null,null,null,null,null,null,null,null,"LA013","No"]
[null,null,null,null,"",null,null,null,null,null,null,null,null,null,null,null,null,null,null,null,null,"LA023","No"]
[null,null,null,null,"",null,null,null,null,null,null,null,null,null,null,null,null,null,null,null,null,"LA024","No"]
[null,null,null,null,"",null,null,null,null,null,null,null,null,null,null,null,null,null,null,null,null,"LA025","No"]
[null,null,null,null,"",null,null,null,null,null,null,null,null,null,null,null,null,null,null,null,null,"LA026","No"]
[null,null,null,null,"",null,null,null,null,null,null,null,null,null,null,null,null,null,null,null,null,"LA027","No"]
[null,null,null,null,"",null,null,null,null,null,null,null,null,null,null,null,null,null,null,null,null,"LA028","No"]
[null,null,null,null,"",null,null,null,null,null,null,null,null,null,null,null,null,null,null,null,null,"LA029","No"]
[null,null,null,null,"",null,null,null,null,null,null,null,null,null,null,null,null,null,null,null,null,"LA030","No"]
[null,null,null,null,"",null,null,null,null,null,null,null,null,null,null,null,null,null,null,null,null,"LA031","No"]
[null,null,null,null,"",null,null,null,null,null,null,null,null,null,null,null,null,null,null,null,null,"LA032","No"]
[null,null,null,null,"",null,null,null,null,null,null,null,null,null,null,null,null,null,null,null,null,"LA033","No"]
[null,null,null,null,"",null,null,null,null,null,null,null,null,null,null,null,null,null,null,null,null,"LA034","No"]
[null,null,null,null,"",null,null,null,null,null,null,null,null,null,null,null,null,null,null,null,null,"LA035","No"]
[null,null,null,null,"",null,null,null,null,null,null,null,null,null,null,null,null,null,null,null,null,"LA036","No"]
[null,null,null,null,"",null,null,null,null,null,null,null,null,null,null,null,null,null,null,null,null,"LA037","No"]
[null,null,null,null,"",null,null,null,null,null,null,null,null,null,null,null,null,null,null,null,null,"LA038","No"]
[null,null,null,null,"",null,null,null,null,null,null,null,null,null,null,null,null,null,null,null,null,"LA039","No"]
[null,null,null,null,"",null,null,null,null,null,null,null,null,null,null,null,null,null,null,null,null,"LA040","No"]
[null,null,null,null,"",null,null,null,null,null,null,null,null,null,null,null,null,null,null,null,null,"LA041","No"]
[null,null,null,null,"",null,null,null,null,null,null,null,null,null,null,null,null,null,null,null,null,"LA042","No"]
[null,null,null,null,"",null,null,null,null,null,null,null,null,null,null,null,null,null,null,null,null,"LA043","No"]
[null,null,null,null,"",null,null,null,null,null,null,null,null,null,null,null,null,null,null,null,null,"LA044","No"]
[null,null,null,null,"",null,null,null,null,null,null,null,null,null,null,null,null,null,null,null,null,"LA045","No"]
[null,null,null,null,"",null,null,null,null,null,null,null,null,null,null,null,null,null,null,null,null,"LA046","No"]
[null,null,null,null,"",null,null,null,null,null,null,null,null,null,null,null,null,null,null,null,null,"LA047","No"]
[null,null,null,null,"",null,null,null,null,null,null,null,null,null,null,null,null,null,null,null,null,"LA052","No"]
[null,null,null,null,"",null,null,null,null,null,null,null,null,null,null,null,null,null,null,null,null,"LA054","No"]
[null,null,null,null,"",null,null,null,null,null,null,null,null,null,null,null,null,null,null,null,null,"LA055","No"]
[null,null,null,null,"",null,null,null,null,null,null,null,null,null,null,null,null,null,null,null,null,"LA056","No"]
[null,null,null,null,"",null,null,null,null,null,null,null,null,null,null,null,null,null,null,null,null,"LA057","No"]
[null,null,null,null,"",null,null,null,null,null,null,null,null,null,null,null,null,null,null,null,null,"LA058","No"]
[null,null,null,null,"",null,null,null,null,null,null,null,null,null,null,null,null,null,null,null,null,"LA059","No"]
[null,null,null,null,"",null,null,null,null,null,null,null,null,null,null,null,null,null,null,null,null,"LA061","No"]
[null,null,null,null,"",null,null,null,null,null,null,null,null,null,null,null,null,null,null,null,null,"LA062","No"]
[null,null,null,null,"",null,null,null,null,null,null,null,null,null,null,null,null,null,null,null,null,"LA063","No"]
[null,null,null,null,"",null,null,null,null,null,null,null,null,null,null,null,null,null,null,null,null,"LA065","No"]
[null,null,null,null,"",null,null,null,null,null,null,null,null,null,null,null,null,null,null,null,null,"LA066","No"]
[null,null,null,null,"",null,null,null,null,null,null,null,null,null,null,null,null,null,null,null,null,"LA067","No"]
[null,null,null,null,"",null,null,null,null,null,null,null,null,null,null,null,null,null,null,null,null,"LA068","No"]
[null,null,null,null,"",null,null,null,null,null,null,null,null,null,null,null,null,null,null,null,null,"LA069","No"]
[null,null,null,null,"",null,null,null,null,null,null,null,null,null,null,null,null,null,null,null,null,"LA070","No"]
[null,null,null,null,"",null,null,null,null,null,null,null,null,null,null,null,null,null,null,null,null,"LA071","No"]
[null,null,null,null,"",null,null,null,null,null,null,null,null,null,null,null,null,null,null,null,null,"LA072","No"]
[null,null,null,null,"",null,null,null,null,null,null,null,null,null,null,null,null,null,null,null,null,"LA073","No"]
[null,null,null,null,"",null,null,null,null,null,null,null,null,null,null,null,null,null,null,null,null,"LA074","No"]
[null,null,null,null,"",null,null,null,null,null,null,null,null,null,null,null,null,null,null,null,null,"LA075","No"]
[null,null,null,null,"",null,null,null,null,null,null,null,null,null,null,null,null,null,null,null,null,"LA076","No"]
[null,null,null,null,"",null,null,null,null,null,null,null,null,null,null,null,null,null,null,null,null,"LA077","No"]
[null,null,null,null,"",null,null,null,null,null,null,null,null,null,null,null,null,null,null,null,null,"LA080","No"]
[null,null,null,null,"",null,null,null,null,null,null,null,null,null,null,null,null,null,null,null,null,"LA082","No"]
[null,null,null,null,"",null,null,null,null,null,null,null,null,null,null,null,null,null,null,null,null,"LA084","No"]
[null,null,null,null,"",null,null,null,null,null,null,null,null,null,null,null,null,null,null,null,null,"LA086","No"]
[null,null,null,null,"",null,null,null,null,null,null,null,null,null,null,null,null,null,null,null,null,"LA088","No"]
[null,null,null,null,"",null,null,null,null,null,null,null,null,null,null,null,null,null,null,null,null,"LA089","No"]
[null,null,null,null,"",null,null,null,null,null,null,null,null,null,null,null,null,null,null,null,null,"LA090","No"]
[null,null,null,null,"",null,null,null,null,null,null,null,null,null,null,null,null,null,null,null,null,"LA091","No"]
[null,null,null,null,"",null,null,null,null,null,null,null,null,null,null,null,null,null,null,null,null,"LA092","No"]
[null,null,null,null,"",null,null,null,null,null,null,null,null,null,null,null,null,null,null,null,null,"LA093","No"]
[null,null,null,null,"",null,null,null,null,null,null,null,null,null,null,null,null,null,null,null,null,"LA094","No"]
[null,null,null,null,"",null,null,null,null,null,null,null,null,null,null,null,null,null,null,null,null,"LA095","No"]
[null,null,null,null,"",null,null,null,null,null,null,null,null,null,null,null,null,null,null,null,null,"LA096","No"]
[null,null,null,null,{"$f":"LEFT(F1155,2)","v":""},null,null,null,null,null,null,null,null,null,null,null,null,null,null,null,null,"LA097","No"]
[null,null,null,null,"",null,null,null,null,null,null,null,null,null,null,null,null,null,null,null,null,"LA098","No"]
[null,null,null,null,"",null,null,null,null,null,null,null,null,null,null,null,null,null,null,null,null,"LA099","No"]
[null,null,null,null,"",null,null,null,null,null,null,null,null,null,null,null,null,null,null,null,null,"LA100","No"]
[null,null,null,null,"",null,null,null,null,null,null,null,null,null,null,null,null,null,null,null,null,"LA101","No"]
[null,null,null,null,"",null,null,null,null,null,null,null,null,null,null,null,null,null,null,null,null,"LA102","No"]
[null,null,null,null,"",null,null,null,null,null,null,null,null,null,null,null,null,null,null,null,null,"LA103","No"]
[null,null,null,null,"",null,null,null,null,null,null,null,null,null,null,null,null,null,null,null,null,"LA105","No"]
[null,null,null,null,"",null,null,null,null,null,null,null,null,null,null,null,null,null,null,null,null,"LA106","No"]
[null,null,null,null,"",null,null,null,null,null,null,null,null,null,null,null,null,null,null,null,null,"LA108","No"]
[null,null,null,null,"",null,null,null,null,null,null,null,null,null,null,null,null,null,null,null,null,"LA109","No"]
[null,null,null,null,"",null,null,null,null,null,null,null,null,null,null,null,null,null,null,null,null,"LA111","No"]
[null,null,null,null,"",null,null,null,null,null,null,null,null,null,null,null,null,null,null,null,null,"LA112","No"]
[null,null,null,null,"",null,null,null,null,null,null,null,null,null,null,null,null,null,null,null,null,"LA113","No"]
[null,null,null,null,"",null,null,null,null,null,null,null,null,null,null,null,null,null,null,null,null,"LA115","No"]
[null,null,null,null,"",null,null,null,null,null,null,null,null,null,null,null,null,null,null,null,null,"LA117","No"]
[null,null,null,null,"",null,null,null,null,null,null,null,null,null,null,null,null,null,null,null,null,"LA118","No"]
[null,null,null,null,"",null,null,null,null,null,null,null,null,null,null,null,null,null,null,null,null,"LA120","No"]
[null,null,null,null,"",null,null,null,null,null,null,null,null,null,null,null,null,null,null,null,null,"LA122","No"]
[null,null,null,null,"",null,null,null,null,null,null,null,null,null,null,null,null,null,null,null,null,"LA123","No"]
[null,null,null,null,"",null,null,null,null,null,null,null,null,null,null,null,null,null,null,null,null,"LA124","No"]
[null,null,null,null,"",null,null,null,null,null,null,null,null,null,null,null,null,null,null,null,null,"LA125","No"]
[null,null,null,null,"",null,null,null,null,null,null,null,null,null,null,null,null,null,null,null,null,"LA127","No"]
[null,null,null,null,"",null,null,null,null,null,null,null,null,null,null,null,null,null,null,null,null,"LA128","No"]
[null,null,null,null,"",null,null,null,null,null,null,null,null,null,null,null,null,null,null,null,null,"LA129","No"]
[null,null,null,null,"",null,null,null,null,null,null,null,null,null,null,null,null,null,null,null,null,"LA130","No"]
[null,null,null,null,"",null,null,null,null,null,null,null,null,null,null,null,null,null,null,null,null,"LA142","No"]
[null,null,null,null,"",null,null,null,null,null,null,null,null,null,null,null,null,null,null,null,null,"LA166","No"]
[null,null,null,null,"",null,null,null,null,null,null,null,null,null,null,null,null,null,null,null,null,"LA231","No"]
[null,null,null,null,"",null,null,null,null,null,null,null,null,null,null,null,null,null,null,null,null,"LA238","No"]
[null,null,null,null,"",null,null,null,null,null,null,null,null,null,null,null,null,null,null,null,null,"LA261","No"]
[null,null,null,null,"",null,null,null,null,null,null,null,null,null,null,null,null,null,null,null,null,"LA262","Yes"]
[null,null,null,null,"",null,null,null,null,null,null,null,null,null,null,null,null,null,null,null,null,"MA001","Yes"]
[null,null,null,null,"",null,null,null,null,null,null,null,null,null,null,null,null,null,null,null,null,"MA002","No"]
[null,null,null,null,"",null,null,null,null,null,null,null,null,null,null,null,null,null,null,null,null,"MA003","No"]
[null,null,null,null,"",null,null,null,null,null,null,null,null,null,null,null,null,null,null,null,null,"MA005","Yes"]
[null,null,null,null,"",null,null,null,null,null,null,null,null,null,null,null,null,null,null,null,null,"MA006","No"]
[null,null,null,null,"",null,null,null,null,null,null,null,null,null,null,null,null,null,null,null,null,"MA007","Yes"]
[null,null,null,null,"",null,null,null,null,null,null,null,null,null,null,null,null,null,null,null,null,"MA008","Yes"]
[null,null,null,null,"",null,null,null,null,null,null,null,null,null,null,null,null,null,null,null,null,"MA010","No"]
[null,null,null,null,"",null,null,null,null,null,null,null,null,null,null,null,null,null,null,null,null,"MA012","No"]
[null,null,null,null,"",null,null,null,null,null,null,null,null,null,null,null,null,null,null,null,null,"MA013","No"]
[null,null,null,null,"",null,null,null,null,null,null,null,null,null,null,null,null,null,null,null,null,"MA014","Yes"]
[null,null,null,null,"",null,null,null,null,null,null,null,null,null,null,null,null,null,null,null,null,"MA015","No"]
[null,null,null,null,"",null,null,null,null,null,null,null,null,null,null,null,null,null,null,null,null,"MA016","No"]
[null,null,null,null,"",null,null,null,null,null,null,null,null,null,null,null,null,null,null,null,null,"MA017","No"]
[null,null,null,null,"",null,null,null,null,null,null,null,null,null,null,null,null,null,null,null,null,"MA019","No"]
[null,null,null,null,"",null,null,null,null,null,null,null,null,null,null,null,null,null,null,null,null,"MA020","Yes"]
[null,null,null,null,"",null,null,null,null,null,null,null,null,null,null,null,null,null,null,null,null,"MA021","Yes"]
[null,null,null,null,"",null,null,null,null,null,null,null,null,null,null,null,null,null,null,null,null,"MA022","Yes"]
[null,null,null,null,"",null,null,null,null,null,null,null,null,null,null,null,null,null,null,null,null,"MA023","No"]
[null,null,null,null,"",null,null,null,null,null,null,null,null,null,null,null,null,null,null,null,null,"MA024","No"]
[null,null,null,null,"",null,null,null,null,null,null,null,null,null,null,null,null,null,null,null,null,"MA025","No"]
[null,null,null,null,"",null,null,null,null,null,null,null,null,null,null,null,null,null,null,null,null,"MA026","No"]
[null,null,null,null,"",null,null,null,null,null,null,null,null,null,null,null,null,null,null,null,null,"MA028","Yes"]
[null,null,null,null,"",null,null,null,null,null,null,null,null,null,null,null,null,null,null,null,null,"MA029","No"]
[null,null,null,null,"",null,null,null,null,null,null,null,null,null,null,null,null,null,null,null,null,"MA031","Yes"]
[null,null,null,null,"",null,null,null,null,null,null,null,null,null,null,null,null,null,null,null,null,"MA032","No"]
[null,null,null,null,"",null,null,null,null,null,null,null,null,null,null,null,null,null,null,null,null,"MA033","No"]
[null,null,null,null,"",null,null,null,null,null,null,null,null,null,null,null,null,null,null,null,null,"MA034","No"]
[null,null,null,null,"",null,null,null,null,null,null,null,null,null,null,null,null,null,null,null,null,"MA035","No"]
[null,null,null,null,"",null,null,null,null,null,null,null,null,null,null,null,null,null,null,null,null,"MA036","No"]
[null,null,null,null,"",null,null,null,null,null,null,null,null,null,null,null,null,null,null,null,null,"MA037","No"]
[null,null,null,null,"",null,null,null,null,null,null,null,null,null,null,null,null,null,null,null,null,"MA039","No"]
[null,null,null,null,{"$f":"LEFT(F1219,2)","v":""},null,null,null,null,null,null,null,null,null,null,null,null,null,null,null,null,"MA040","No"]
[null,null,null,null,"",null,null,null,null,null,null,null,null,null,null,null,null,null,null,null,null,"MA041","No"]
[null,null,null,null,"",null,null,null,null,null,null,null,null,null,null,null,null,null,null,null,null,"MA043","No"]
[null,null,null,null,"",null,null,null,null,null,null,null,null,null,null,null,null,null,null,null,null,"MA044","No"]
[null,null,null,null,"",null,null,null,null,null,null,null,null,null,null,null,null,null,null,null,null,"MA045","No"]
[null,null,null,null,"",null,null,null,null,null,null,null,null,null,null,null,null,null,null,null,null,"MA046","No"]
[null,null,null,null,"",null,null,null,null,null,null,null,null,null,null,null,null,null,null,null,null,"MA047","No"]
[null,null,null,null,"",null,null,null,null,null,null,null,null,null,null,null,null,null,null,null,null,"MA049","No"]
[null,null,null,null,"",null,null,null,null,null,null,null,null,null,null,null,null,null,null,null,null,"MA055","No"]
[null,null,null,null,"",null,null,null,null,null,null,null,null,null,null,null,null,null,null,null,null,"MA059","No"]
[null,null,null,null,"",null,null,null,null,null,null,null,null,null,null,null,null,null,null,null,null,"MA065","No"]
[null,null,null,null,"",null,null,null,null,null,null,null,null,null,null,null,null,null,null,null,null,"MA067","No"]
[null,null,null,null,"",null,null,null,null,null,null,null,null,null,null,null,null,null,null,null,null,"MA069","No"]
[null,null,null,null,"",null,null,null,null,null,null,null,null,null,null,null,null,null,null,null,null,"MA074","No"]
[null,null,null,null,"",null,null,null,null,null,null,null,null,null,null,null,null,null,null,null,null,"MA081","No"]
[null,null,null,null,"",null,null,null,null,null,null,null,null,null,null,null,null,null,null,null,null,"MA085","No"]
[null,null,null,null,"",null,null,null,null,null,null,null,null,null,null,null,null,null,null,null,null,"MA091","No"]
[null,null,null,null,"",null,null,null,null,null,null,null,null,null,null,null,null,null,null,null,null,"MA093","No"]
[null,null,null,null,"",null,null,null,null,null,null,null,null,null,null,null,null,null,null,null,null,"MA098","No"]
[null,null,null,null,"",null,null,null,null,null,null,null,null,null,null,null,null,null,null,null,null,"MA099","No"]
[null,null,null,null,"",null,null,null,null,null,null,null,null,null,null,null,null,null,null,null,null,"MA101","No"]
[null,null,null,null,"",null,null,null,null,null,null,null,null,null,null,null,null,null,null,null,null,"MA107","No"]
[null,null,null,null,"",null,null,null,null,null,null,null,null,null,null,null,null,null,null,null,null,"MA109","No"]
[null,null,null,null,"",null,null,null,null,null,null,null,null,null,null,null,null,null,null,null,null,"MA110","No"]
[null,null,null,null,"",null,null,null,null,null,null,null,null,null,null,null,null,null,null,null,null,"MA111","No"]
[null,null,null,null,"",null,null,null,null,null,null,null,null,null,null,null,null,null,null,null,null,"MA117","No"]
[null,null,null,null,"",null,null,null,null,null,null,null,null,null,null,null,null,null,null,null,null,"MA118","No"]
[null,null,null,null,"",null,null,null,null,null,null,null,null,null,null,null,null,null,null,null,null,"MA123","No"]
[null,null,null,null,"",null,null,null,null,null,null,null,null,null,null,null,null,null,null,null,null,"MA132","No"]
[null,null,null,null,"",null,null,null,null,null,null,null,null,null,null,null,null,null,null,null,null,"MA133","No"]
[null,null,null,null,"",null,null,null,null,null,null,null,null,null,null,null,null,null,null,null,null,"MA137","No"]
[null,null,null,null,"",null,null,null,null,null,null,null,null,null,null,null,null,null,null,null,null,"MA139","No"]
[null,null,null,null,"",null,null,null,null,null,null,null,null,null,null,null,null,null,null,null,null,"MA155","No"]
[null,null,null,null,"",null,null,null,null,null,null,null,null,null,null,null,null,null,null,null,null,"MA157","No"]
[null,null,null,null,"",null,null,null,null,null,null,null,null,null,null,null,null,null,null,null,null,"MA159","No"]
[null,null,null,null,"",null,null,null,null,null,null,null,null,null,null,null,null,null,null,null,null,"MA169","Yes"]
[null,null,null,null,"",null,null,null,null,null,null,null,null,null,null,null,null,null,null,null,null,"MD001","No"]
[null,null,null,null,"",null,null,null,null,null,null,null,null,null,null,null,null,null,null,null,null,"MD002","Yes"]
[null,null,null,null,"",null,null,null,null,null,null,null,null,null,null,null,null,null,null,null,null,"MD003","Yes"]
[null,null,null,null,"",null,null,null,null,null,null,null,null,null,null,null,null,null,null,null,null,"MD004","Yes"]
[null,null,null,null,"",null,null,null,null,null,null,null,null,null,null,null,null,null,null,null,null,"MD005","No"]
[null,null,null,null,"",null,null,null,null,null,null,null,null,null,null,null,null,null,null,null,null,"MD006","No"]
[null,null,null,null,"",null,null,null,null,null,null,null,null,null,null,null,null,null,null,null,null,"MD007","No"]
[null,null,null,null,"",null,null,null,null,null,null,null,null,null,null,null,null,null,null,null,null,"MD008","No"]
[null,null,null,null,"",null,null,null,null,null,null,null,null,null,null,null,null,null,null,null,null,"MD009","No"]
[null,null,null,null,"",null,null,null,null,null,null,null,null,null,null,null,null,null,null,null,null,"MD010","No"]
[null,null,null,null,"",null,null,null,null,null,null,null,null,null,null,null,null,null,null,null,null,"MD011","No"]
[null,null,null,null,"",null,null,null,null,null,null,null,null,null,null,null,null,null,null,null,null,"MD012","No"]
[null,null,null,null,"",null,null,null,null,null,null,null,null,null,null,null,null,null,null,null,null,"MD013","No"]
[null,null,null,null,"",null,null,null,null,null,null,null,null,null,null,null,null,null,null,null,null,"MD014","No"]
[null,null,null,null,"",null,null,null,null,null,null,null,null,null,null,null,null,null,null,null,null,"MD015","No"]
[null,null,null,null,"",null,null,null,null,null,null,null,null,null,null,null,null,null,null,null,null,"MD016","No"]
[null,null,null,null,"",null,null,null,null,null,null,null,null,null,null,null,null,null,null,null,null,"MD017","No"]
[null,null,null,null,"",null,null,null,null,null,null,null,null,null,null,null,null,null,null,null,null,"MD018","No"]
[null,null,null,null,"",null,null,null,null,null,null,null,null,null,null,null,null,null,null,null,null,"MD019","No"]
[null,null,null,null,"",null,null,null,null,null,null,null,null,null,null,null,null,null,null,null,null,"MD021","No"]
[null,null,null,null,"",null,null,null,null,null,null,null,null,null,null,null,null,null,null,null,null,"MD022","No"]
[null,null,null,null,"",null,null,null,null,null,null,null,null,null,null,null,null,null,null,null,null,"MD023","No"]
[null,null,null,null,"",null,null,null,null,null,null,null,null,null,null,null,null,null,null,null,null,"MD028","No"]
[null,null,null,null,"",null,null,null,null,null,null,null,null,null,null,null,null,null,null,null,null,"MD030","No"]
[null,null,null,null,"",null,null,null,null,null,null,null,null,null,null,null,null,null,null,null,null,"MD034","No"]
[null,null,null,null,"",null,null,null,null,null,null,null,null,null,null,null,null,null,null,null,null,"ME001","Yes"]
[null,null,null,null,"",null,null,null,null,null,null,null,null,null,null,null,null,null,null,null,null,"ME002","No"]
[null,null,null,null,"",null,null,null,null,null,null,null,null,null,null,null,null,null,null,null,null,"ME003","No"]
[null,null,null,null,{"$f":"LEFT(F1283,2)","v":""},null,null,null,null,null,null,null,null,null,null,null,null,null,null,null,null,"ME004","No"]
[null,null,null,null,"",null,null,null,null,null,null,null,null,null,null,null,null,null,null,null,null,"ME005","No"]
[null,null,null,null,"",null,null,null,null,null,null,null,null,null,null,null,null,null,null,null,null,"ME006","No"]
[null,null,null,null,"",null,null,null,null,null,null,null,null,null,null,null,null,null,null,null,null,"ME007","No"]
[null,null,null,null,"",null,null,null,null,null,null,null,null,null,null,null,null,null,null,null,null,"ME008","No"]
[null,null,null,null,"",null,null,null,null,null,null,null,null,null,null,null,null,null,null,null,null,"ME009","No"]
[null,null,null,null,"",null,null,null,null,null,null,null,null,null,null,null,null,null,null,null,null,"ME011","No"]
[null,null,null,null,"",null,null,null,null,null,null,null,null,null,null,null,null,null,null,null,null,"ME015","No"]
[null,null,null,null,"",null,null,null,null,null,null,null,null,null,null,null,null,null,null,null,null,"ME018","No"]
[null,null,null,null,"",null,null,null,null,null,null,null,null,null,null,null,null,null,null,null,null,"ME019","Yes"]
[null,null,null,null,"",null,null,null,null,null,null,null,null,null,null,null,null,null,null,null,null,"ME020","No"]
[null,null,null,null,"",null,null,null,null,null,null,null,null,null,null,null,null,null,null,null,null,"ME021","No"]
[null,null,null,null,"",null,null,null,null,null,null,null,null,null,null,null,null,null,null,null,null,"ME022","No"]
[null,null,null,null,"",null,null,null,null,null,null,null,null,null,null,null,null,null,null,null,null,"ME023","No"]
[null,null,null,null,"",null,null,null,null,null,null,null,null,null,null,null,null,null,null,null,null,"ME024","No"]
[null,null,null,null,"",null,null,null,null,null,null,null,null,null,null,null,null,null,null,null,null,"ME026","No"]
[null,null,null,null,"",null,null,null,null,null,null,null,null,null,null,null,null,null,null,null,null,"ME027","No"]
[null,null,null,null,"",null,null,null,null,null,null,null,null,null,null,null,null,null,null,null,null,"MI001","No"]
[null,null,null,null,"",null,null,null,null,null,null,null,null,null,null,null,null,null,null,null,null,"MI003","No"]
[null,null,null,null,"",null,null,null,null,null,null,null,null,null,null,null,null,null,null,null,null,"MI004","Yes"]
[null,null,null,null,"",null,null,null,null,null,null,null,null,null,null,null,null,null,null,null,null,"MI005","No"]
[null,null,null,null,"",null,null,null,null,null,null,null,null,null,null,null,null,null,null,null,null,"MI006","No"]
[null,null,null,null,"",null,null,null,null,null,null,null,null,null,null,null,null,null,null,null,null,"MI007","Yes"]
[null,null,null,null,"",null,null,null,null,null,null,null,null,null,null,null,null,null,null,null,null,"MI008","No"]
[null,null,null,null,"",null,null,null,null,null,null,null,null,null,null,null,null,null,null,null,null,"MI009","No"]
[null,null,null,null,"",null,null,null,null,null,null,null,null,null,null,null,null,null,null,null,null,"MI010","No"]
[null,null,null,null,"",null,null,null,null,null,null,null,null,null,null,null,null,null,null,null,null,"MI011","No"]
[null,null,null,null,"",null,null,null,null,null,null,null,null,null,null,null,null,null,null,null,null,"MI012","No"]
[null,null,null,null,"",null,null,null,null,null,null,null,null,null,null,null,null,null,null,null,null,"MI013","No"]
[null,null,null,null,"",null,null,null,null,null,null,null,null,null,null,null,null,null,null,null,null,"MI014","No"]
[null,null,null,null,"",null,null,null,null,null,null,null,null,null,null,null,null,null,null,null,null,"MI015","No"]
[null,null,null,null,"",null,null,null,null,null,null,null,null,null,null,null,null,null,null,null,null,"MI016","No"]
[null,null,null,null,"",null,null,null,null,null,null,null,null,null,null,null,null,null,null,null,null,"MI018","No"]
[null,null,null,null,"",null,null,null,null,null,null,null,null,null,null,null,null,null,null,null,null,"MI019","No"]
[null,null,null,null,"",null,null,null,null,null,null,null,null,null,null,null,null,null,null,null,null,"MI020","No"]
[null,null,null,null,"",null,null,null,null,null,null,null,null,null,null,null,null,null,null,null,null,"MI021","No"]
[null,null,null,null,"",null,null,null,null,null,null,null,null,null,null,null,null,null,null,null,null,"MI022","No"]
[null,null,null,null,"",null,null,null,null,null,null,null,null,null,null,null,null,null,null,null,null,"MI023","No"]
[null,null,null,null,"",null,null,null,null,null,null,null,null,null,null,null,null,null,null,null,null,"MI024","No"]
[null,null,null,null,"",null,null,null,null,null,null,null,null,null,null,null,null,null,null,null,null,"MI025","Yes"]
[null,null,null,null,"",null,null,null,null,null,null,null,null,null,null,null,null,null,null,null,null,"MI026","No"]
[null,null,null,null,"",null,null,null,null,null,null,null,null,null,null,null,null,null,null,null,null,"MI027","No"]
[null,null,null,null,"",null,null,null,null,null,null,null,null,null,null,null,null,null,null,null,null,"MI028","No"]
[null,null,null,null,"",null,null,null,null,null,null,null,null,null,null,null,null,null,null,null,null,"MI029","No"]
[null,null,null,null,"",null,null,null,null,null,null,null,null,null,null,null,null,null,null,null,null,"MI030","Yes"]
[null,null,null,null,"",null,null,null,null,null,null,null,null,null,null,null,null,null,null,null,null,"MI031","No"]
[null,null,null,null,"",null,null,null,null,null,null,null,null,null,null,null,null,null,null,null,null,"MI032","No"]
[null,null,null,null,"",null,null,null,null,null,null,null,null,null,null,null,null,null,null,null,null,"MI033","No"]
[null,null,null,null,"",null,null,null,null,null,null,null,null,null,null,null,null,null,null,null,null,"MI035","No"]
[null,null,null,null,"",null,null,null,null,null,null,null,null,null,null,null,null,null,null,null,null,"MI036","Yes"]
[null,null,null,null,"",null,null,null,null,null,null,null,null,null,null,null,null,null,null,null,null,"MI037","Yes"]
[null,null,null,null,"",null,null,null,null,null,null,null,null,null,null,null,null,null,null,null,null,"MI038","No"]
[null,null,null,null,"",null,null,null,null,null,null,null,null,null,null,null,null,null,null,null,null,"MI039","No"]
[null,null,null,null,"",null,null,null,null,null,null,null,null,null,null,null,null,null,null,null,null,"MI040","No"]
[null,null,null,null,"",null,null,null,null,null,null,null,null,null,null,null,null,null,null,null,null,"MI041","No"]
[null,null,null,null,"",null,null,null,null,null,null,null,null,null,null,null,null,null,null,null,null,"MI042","Yes"]
[null,null,null,null,"",null,null,null,null,null,null,null,null,null,null,null,null,null,null,null,null,"MI044","No"]
[null,null,null,null,"",null,null,null,null,null,null,null,null,null,null,null,null,null,null,null,null,"MI045","No"]
[null,null,null,null,"",null,null,null,null,null,null,null,null,null,null,null,null,null,null,null,null,"MI046","No"]
[null,null,null,null,"",null,null,null,null,null,null,null,null,null,null,null,null,null,null,null,null,"MI047","No"]
[null,null,null,null,"",null,null,null,null,null,null,null,null,null,null,null,null,null,null,null,null,"MI048","No"]
[null,null,null,null,"",null,null,null,null,null,null,null,null,null,null,null,null,null,null,null,null,"MI049","No"]
[null,null,null,null,"",null,null,null,null,null,null,null,null,null,null,null,null,null,null,null,null,"MI050","No"]
[null,null,null,null,"",null,null,null,null,null,null,null,null,null,null,null,null,null,null,null,null,"MI051","No"]
[null,null,null,null,{"$f":"LEFT(F1347,2)","v":""},null,null,null,null,null,null,null,null,null,null,null,null,null,null,null,null,"MI052","No"]
[null,null,null,null,"",null,null,null,null,null,null,null,null,null,null,null,null,null,null,null,null,"MI053","No"]
[null,null,null,null,"",null,null,null,null,null,null,null,null,null,null,null,null,null,null,null,null,"MI054","No"]
[null,null,null,null,"",null,null,null,null,null,null,null,null,null,null,null,null,null,null,null,null,"MI055","No"]
[null,null,null,null,"",null,null,null,null,null,null,null,null,null,null,null,null,null,null,null,null,"MI056","No"]
[null,null,null,null,"",null,null,null,null,null,null,null,null,null,null,null,null,null,null,null,null,"MI057","No"]
[null,null,null,null,"",null,null,null,null,null,null,null,null,null,null,null,null,null,null,null,null,"MI058","No"]
[null,null,null,null,"",null,null,null,null,null,null,null,null,null,null,null,null,null,null,null,null,"MI059","No"]
[null,null,null,null,"",null,null,null,null,null,null,null,null,null,null,null,null,null,null,null,null,"MI060","No"]
[null,null,null,null,"",null,null,null,null,null,null,null,null,null,null,null,null,null,null,null,null,"MI061","Yes"]
[null,null,null,null,"",null,null,null,null,null,null,null,null,null,null,null,null,null,null,null,null,"MI063","No"]
[null,null,null,null,"",null,null,null,null,null,null,null,null,null,null,null,null,null,null,null,null,"MI064","No"]
[null,null,null,null,"",null,null,null,null,null,null,null,null,null,null,null,null,null,null,null,null,"MI066","No"]
[null,null,null,null,"",null,null,null,null,null,null,null,null,null,null,null,null,null,null,null,null,"MI068","No"]
[null,null,null,null,"",null,null,null,null,null,null,null,null,null,null,null,null,null,null,null,null,"MI069","No"]
[null,null,null,null,"",null,null,null,null,null,null,null,null,null,null,null,null,null,null,null,null,"MI070","No"]
[null,null,null,null,"",null,null,null,null,null,null,null,null,null,null,null,null,null,null,null,null,"MI071","No"]
[null,null,null,null,"",null,null,null,null,null,null,null,null,null,null,null,null,null,null,null,null,"MI072","No"]
[null,null,null,null,"",null,null,null,null,null,null,null,null,null,null,null,null,null,null,null,null,"MI073","No"]
[null,null,null,null,"",null,null,null,null,null,null,null,null,null,null,null,null,null,null,null,null,"MI074","No"]
[null,null,null,null,"",null,null,null,null,null,null,null,null,null,null,null,null,null,null,null,null,"MI076","No"]
[null,null,null,null,"",null,null,null,null,null,null,null,null,null,null,null,null,null,null,null,null,"MI077","No"]
[null,null,null,null,"",null,null,null,null,null,null,null,null,null,null,null,null,null,null,null,null,"MI078","No"]
[null,null,null,null,"",null,null,null,null,null,null,null,null,null,null,null,null,null,null,null,null,"MI079","No"]
[null,null,null,null,"",null,null,null,null,null,null,null,null,null,null,null,null,null,null,null,null,"MI080","No"]
[null,null,null,null,"",null,null,null,null,null,null,null,null,null,null,null,null,null,null,null,null,"MI081","No"]
[null,null,null,null,"",null,null,null,null,null,null,null,null,null,null,null,null,null,null,null,null,"MI082","No"]
[null,null,null,null,"",null,null,null,null,null,null,null,null,null,null,null,null,null,null,null,null,"MI083","No"]
[null,null,null,null,"",null,null,null,null,null,null,null,null,null,null,null,null,null,null,null,null,"MI084","No"]
[null,null,null,null,"",null,null,null,null,null,null,null,null,null,null,null,null,null,null,null,null,"MI087","No"]
[null,null,null,null,"",null,null,null,null,null,null,null,null,null,null,null,null,null,null,null,null,"MI088","No"]
[null,null,null,null,"",null,null,null,null,null,null,null,null,null,null,null,null,null,null,null,null,"MI089","No"]
[null,null,null,null,"",null,null,null,null,null,null,null,null,null,null,null,null,null,null,null,null,"MI090","No"]
[null,null,null,null,"",null,null,null,null,null,null,null,null,null,null,null,null,null,null,null,null,"MI091","No"]
[null,null,null,null,"",null,null,null,null,null,null,null,null,null,null,null,null,null,null,null,null,"MI093","No"]
[null,null,null,null,"",null,null,null,null,null,null,null,null,null,null,null,null,null,null,null,null,"MI094","No"]
[null,null,null,null,"",null,null,null,null,null,null,null,null,null,null,null,null,null,null,null,null,"MI095","No"]
[null,null,null,null,"",null,null,null,null,null,null,null,null,null,null,null,null,null,null,null,null,"MI096","No"]
[null,null,null,null,"",null,null,null,null,null,null,null,null,null,null,null,null,null,null,null,null,"MI098","No"]
[null,null,null,null,"",null,null,null,null,null,null,null,null,null,null,null,null,null,null,null,null,"MI100","No"]
[null,null,null,null,"",null,null,null,null,null,null,null,null,null,null,null,null,null,null,null,null,"MI101","No"]
[null,null,null,null,"",null,null,null,null,null,null,null,null,null,null,null,null,null,null,null,null,"MI102","No"]
[null,null,null,null,"",null,null,null,null,null,null,null,null,null,null,null,null,null,null,null,null,"MI103","No"]
[null,null,null,null,"",null,null,null,null,null,null,null,null,null,null,null,null,null,null,null,null,"MI104","No"]
[null,null,null,null,"",null,null,null,null,null,null,null,null,null,null,null,null,null,null,null,null,"MI105","No"]
[null,null,null,null,"",null,null,null,null,null,null,null,null,null,null,null,null,null,null,null,null,"MI107","No"]
[null,null,null,null,"",null,null,null,null,null,null,null,null,null,null,null,null,null,null,null,null,"MI108","No"]
[null,null,null,null,"",null,null,null,null,null,null,null,null,null,null,null,null,null,null,null,null,"MI112","No"]
[null,null,null,null,"",null,null,null,null,null,null,null,null,null,null,null,null,null,null,null,null,"MI114","No"]
[null,null,null,null,"",null,null,null,null,null,null,null,null,null,null,null,null,null,null,null,null,"MI115","No"]
[null,null,null,null,"",null,null,null,null,null,null,null,null,null,null,null,null,null,null,null,null,"MI116","No"]
[null,null,null,null,"",null,null,null,null,null,null,null,null,null,null,null,null,null,null,null,null,"MI117","No"]
[null,null,null,null,"",null,null,null,null,null,null,null,null,null,null,null,null,null,null,null,null,"MI118","No"]
[null,null,null,null,"",null,null,null,null,null,null,null,null,null,null,null,null,null,null,null,null,"MI119","No"]
[null,null,null,null,"",null,null,null,null,null,null,null,null,null,null,null,null,null,null,null,null,"MI120","No"]
[null,null,null,null,"",null,null,null,null,null,null,null,null,null,null,null,null,null,null,null,null,"MI121","No"]
[null,null,null,null,"",null,null,null,null,null,null,null,null,null,null,null,null,null,null,null,null,"MI124","No"]
[null,null,null,null,"",null,null,null,null,null,null,null,null,null,null,null,null,null,null,null,null,"MI142","No"]
[null,null,null,null,"",null,null,null,null,null,null,null,null,null,null,null,null,null,null,null,null,"MI156","No"]
[null,null,null,null,"",null,null,null,null,null,null,null,null,null,null,null,null,null,null,null,null,"MI157","No"]
[null,null,null,null,"",null,null,null,null,null,null,null,null,null,null,null,null,null,null,null,null,"MI158","No"]
[null,null,null,null,"",null,null,null,null,null,null,null,null,null,null,null,null,null,null,null,null,"MI161","No"]
[null,null,null,null,"",null,null,null,null,null,null,null,null,null,null,null,null,null,null,null,null,"MI166","No"]
[null,null,null,null,"",null,null,null,null,null,null,null,null,null,null,null,null,null,null,null,null,"MI167","No"]
[null,null,null,null,{"$f":"LEFT(F1411,2)","v":""},null,null,null,null,null,null,null,null,null,null,null,null,null,null,null,null,"MI168","No"]
[null,null,null,null,"",null,null,null,null,null,null,null,null,null,null,null,null,null,null,null,null,"MI178","No"]
[null,null,null,null,"",null,null,null,null,null,null,null,null,null,null,null,null,null,null,null,null,"MI180","No"]
[null,null,null,null,"",null,null,null,null,null,null,null,null,null,null,null,null,null,null,null,null,"MI181","No"]
[null,null,null,null,"",null,null,null,null,null,null,null,null,null,null,null,null,null,null,null,null,"MI182","No"]
[null,null,null,null,"",null,null,null,null,null,null,null,null,null,null,null,null,null,null,null,null,"MI183","No"]
[null,null,null,null,"",null,null,null,null,null,null,null,null,null,null,null,null,null,null,null,null,"MI186","No"]
[null,null,null,null,"",null,null,null,null,null,null,null,null,null,null,null,null,null,null,null,null,"MI187","No"]
[null,null,null,null,"",null,null,null,null,null,null,null,null,null,null,null,null,null,null,null,null,"MI189","No"]
[null,null,null,null,"",null,null,null,null,null,null,null,null,null,null,null,null,null,null,null,null,"MI191","No"]
[null,null,null,null,"",null,null,null,null,null,null,null,null,null,null,null,null,null,null,null,null,"MI192","Yes"]
[null,null,null,null,"",null,null,null,null,null,null,null,null,null,null,null,null,null,null,null,null,"MI194","Yes"]
[null,null,null,null,"",null,null,null,null,null,null,null,null,null,null,null,null,null,null,null,null,"MN001","Yes"]
[null,null,null,null,"",null,null,null,null,null,null,null,null,null,null,null,null,null,null,null,null,"MN002","No"]
[null,null,null,null,"",null,null,null,null,null,null,null,null,null,null,null,null,null,null,null,null,"MN003","No"]
[null,null,null,null,"",null,null,null,null,null,null,null,null,null,null,null,null,null,null,null,null,"MN004","No"]
[null,null,null,null,"",null,null,null,null,null,null,null,null,null,null,null,null,null,null,null,null,"MN005","No"]
[null,null,null,null,"",null,null,null,null,null,null,null,null,null,null,null,null,null,null,null,null,"MN006","No"]
[null,null,null,null,"",null,null,null,null,null,null,null,null,null,null,null,null,null,null,null,null,"MN007","No"]
[null,null,null,null,"",null,null,null,null,null,null,null,null,null,null,null,null,null,null,null,null,"MN008","Yes"]
[null,null,null,null,"",null,null,null,null,null,null,null,null,null,null,null,null,null,null,null,null,"MN009","No"]
[null,null,null,null,"",null,null,null,null,null,null,null,null,null,null,null,null,null,null,null,null,"MN010","No"]
[null,null,null,null,"",null,null,null,null,null,null,null,null,null,null,null,null,null,null,null,null,"MN011","No"]
[null,null,null,null,"",null,null,null,null,null,null,null,null,null,null,null,null,null,null,null,null,"MN014","No"]
[null,null,null,null,"",null,null,null,null,null,null,null,null,null,null,null,null,null,null,null,null,"MN017","No"]
[null,null,null,null,"",null,null,null,null,null,null,null,null,null,null,null,null,null,null,null,null,"MN018","No"]
[null,null,null,null,"",null,null,null,null,null,null,null,null,null,null,null,null,null,null,null,null,"MN019","No"]
[null,null,null,null,"",null,null,null,null,null,null,null,null,null,null,null,null,null,null,null,null,"MN020","No"]
[null,null,null,null,"",null,null,null,null,null,null,null,null,null,null,null,null,null,null,null,null,"MN021","No"]
[null,null,null,null,"",null,null,null,null,null,null,null,null,null,null,null,null,null,null,null,null,"MN022","No"]
[null,null,null,null,"",null,null,null,null,null,null,null,null,null,null,null,null,null,null,null,null,"MN023","No"]
[null,null,null,null,"",null,null,null,null,null,null,null,null,null,null,null,null,null,null,null,null,"MN024","No"]
[null,null,null,null,"",null,null,null,null,null,null,null,null,null,null,null,null,null,null,null,null,"MN025","No"]
[null,null,null,null,"",null,null,null,null,null,null,null,null,null,null,null,null,null,null,null,null,"MN026","No"]
[null,null,null,null,"",null,null,null,null,null,null,null,null,null,null,null,null,null,null,null,null,"MN027","No"]
[null,null,null,null,"",null,null,null,null,null,null,null,null,null,null,null,null,null,null,null,null,"MN028","No"]
[null,null,null,null,"",null,null,null,null,null,null,null,null,null,null,null,null,null,null,null,null,"MN029","No"]
[null,null,null,null,"",null,null,null,null,null,null,null,null,null,null,null,null,null,null,null,null,"MN030","No"]
[null,null,null,null,"",null,null,null,null,null,null,null,null,null,null,null,null,null,null,null,null,"MN031","No"]
[null,null,null,null,"",null,null,null,null,null,null,null,null,null,null,null,null,null,null,null,null,"MN032","No"]
[null,null,null,null,"",null,null,null,null,null,null,null,null,null,null,null,null,null,null,null,null,"MN033","No"]
[null,null,null,null,"",null,null,null,null,null,null,null,null,null,null,null,null,null,null,null,null,"MN034","No"]
[null,null,null,null,"",null,null,null,null,null,null,null,null,null,null,null,null,null,null,null,null,"MN035","No"]
[null,null,null,null,"",null,null,null,null,null,null,null,null,null,null,null,null,null,null,null,null,"MN036","No"]
[null,null,null,null,"",null,null,null,null,null,null,null,null,null,null,null,null,null,null,null,null,"MN037","No"]
[null,null,null,null,"",null,null,null,null,null,null,null,null,null,null,null,null,null,null,null,null,"MN038","No"]
[null,null,null,null,"",null,null,null,null,null,null,null,null,null,null,null,null,null,null,null,null,"MN039","No"]
[null,null,null,null,"",null,null,null,null,null,null,null,null,null,null,null,null,null,null,null,null,"MN040","No"]
[null,null,null,null,"",null,null,null,null,null,null,null,null,null,null,null,null,null,null,null,null,"MN041","No"]
[null,null,null,null,"",null,null,null,null,null,null,null,null,null,null,null,null,null,null,null,null,"MN042","No"]
[null,null,null,null,"",null,null,null,null,null,null,null,null,null,null,null,null,null,null,null,null,"MN043","No"]
[null,null,null,null,"",null,null,null,null,null,null,null,null,null,null,null,null,null,null,null,null,"MN044","No"]
[null,null,null,null,"",null,null,null,null,null,null,null,null,null,null,null,null,null,null,null,null,"MN046","No"]
[null,null,null,null,"",null,null,null,null,null,null,null,null,null,null,null,null,null,null,null,null,"MN047","No"]
[null,null,null,null,"",null,null,null,null,null,null,null,null,null,null,null,null,null,null,null,null,"MN048","No"]
[null,null,null,null,"",null,null,null,null,null,null,null,null,null,null,null,null,null,null,null,null,"MN049","No"]
[null,null,null,null,"",null,null,null,null,null,null,null,null,null,null,null,null,null,null,null,null,"MN051","No"]
[null,null,null,null,"",null,null,null,null,null,null,null,null,null,null,null,null,null,null,null,null,"MN052","No"]
[null,null,null,null,"",null,null,null,null,null,null,null,null,null,null,null,null,null,null,null,null,"MN053","No"]
[null,null,null,null,"",null,null,null,null,null,null,null,null,null,null,null,null,null,null,null,null,"MN054","No"]
[null,null,null,null,"",null,null,null,null,null,null,null,null,null,null,null,null,null,null,null,null,"MN055","No"]
[null,null,null,null,"",null,null,null,null,null,null,null,null,null,null,null,null,null,null,null,null,"MN056","No"]
[null,null,null,null,"",null,null,null,null,null,null,null,null,null,null,null,null,null,null,null,null,"MN057","No"]
[null,null,null,null,"",null,null,null,null,null,null,null,null,null,null,null,null,null,null,null,null,"MN058","No"]
[null,null,null,null,{"$f":"LEFT(F1475,2)","v":""},null,null,null,null,null,null,null,null,null,null,null,null,null,null,null,null,"MN059","No"]
[null,null,null,null,"",null,null,null,null,null,null,null,null,null,null,null,null,null,null,null,null,"MN060","No"]
[null,null,null,null,"",null,null,null,null,null,null,null,null,null,null,null,null,null,null,null,null,"MN061","No"]
[null,null,null,null,"",null,null,null,null,null,null,null,null,null,null,null,null,null,null,null,null,"MN062","No"]
[null,null,null,null,"",null,null,null,null,null,null,null,null,null,null,null,null,null,null,null,null,"MN063","No"]
[null,null,null,null,"",null,null,null,null,null,null,null,null,null,null,null,null,null,null,null,null,"MN064","No"]
[null,null,null,null,"",null,null,null,null,null,null,null,null,null,null,null,null,null,null,null,null,"MN065","No"]
[null,null,null,null,"",null,null,null,null,null,null,null,null,null,null,null,null,null,null,null,null,"MN067","No"]
[null,null,null,null,"",null,null,null,null,null,null,null,null,null,null,null,null,null,null,null,null,"MN068","No"]
[null,null,null,null,"",null,null,null,null,null,null,null,null,null,null,null,null,null,null,null,null,"MN069","No"]
[null,null,null,null,"",null,null,null,null,null,null,null,null,null,null,null,null,null,null,null,null,"MN070","No"]
[null,null,null,null,"",null,null,null,null,null,null,null,null,null,null,null,null,null,null,null,null,"MN071","No"]
[null,null,null,null,"",null,null,null,null,null,null,null,null,null,null,null,null,null,null,null,null,"MN072","No"]
[null,null,null,null,"",null,null,null,null,null,null,null,null,null,null,null,null,null,null,null,null,"MN073","No"]
[null,null,null,null,"",null,null,null,null,null,null,null,null,null,null,null,null,null,null,null,null,"MN074","No"]
[null,null,null,null,"",null,null,null,null,null,null,null,null,null,null,null,null,null,null,null,null,"MN075","No"]
[null,null,null,null,"",null,null,null,null,null,null,null,null,null,null,null,null,null,null,null,null,"MN076","No"]
[null,null,null,null,"",null,null,null,null,null,null,null,null,null,null,null,null,null,null,null,null,"MN077","No"]
[null,null,null,null,"",null,null,null,null,null,null,null,null,null,null,null,null,null,null,null,null,"MN078","No"]
[null,null,null,null,"",null,null,null,null,null,null,null,null,null,null,null,null,null,null,null,null,"MN080","No"]
[null,null,null,null,"",null,null,null,null,null,null,null,null,null,null,null,null,null,null,null,null,"MN082","No"]
[null,null,null,null,"",null,null,null,null,null,null,null,null,null,null,null,null,null,null,null,null,"MN083","No"]
[null,null,null,null,"",null,null,null,null,null,null,null,null,null,null,null,null,null,null,null,null,"MN085","No"]
[null,null,null,null,"",null,null,null,null,null,null,null,null,null,null,null,null,null,null,null,null,"MN086","No"]
[null,null,null,null,"",null,null,null,null,null,null,null,null,null,null,null,null,null,null,null,null,"MN087","No"]
[null,null,null,null,"",null,null,null,null,null,null,null,null,null,null,null,null,null,null,null,null,"MN088","No"]
[null,null,null,null,"",null,null,null,null,null,null,null,null,null,null,null,null,null,null,null,null,"MN089","No"]
[null,null,null,null,"",null,null,null,null,null,null,null,null,null,null,null,null,null,null,null,null,"MN090","No"]
[null,null,null,null,"",null,null,null,null,null,null,null,null,null,null,null,null,null,null,null,null,"MN091","No"]
[null,null,null,null,"",null,null,null,null,null,null,null,null,null,null,null,null,null,null,null,null,"MN092","No"]
[null,null,null,null,"",null,null,null,null,null,null,null,null,null,null,null,null,null,null,null,null,"MN095","No"]
[null,null,null,null,"",null,null,null,null,null,null,null,null,null,null,null,null,null,null,null,null,"MN096","No"]
[null,null,null,null,"",null,null,null,null,null,null,null,null,null,null,null,null,null,null,null,null,"MN097","No"]
[null,null,null,null,"",null,null,null,null,null,null,null,null,null,null,null,null,null,null,null,null,"MN098","No"]
[null,null,null,null,"",null,null,null,null,null,null,null,null,null,null,null,null,null,null,null,null,"MN100","No"]
[null,null,null,null,"",null,null,null,null,null,null,null,null,null,null,null,null,null,null,null,null,"MN101","No"]
[null,null,null,null,"",null,null,null,null,null,null,null,null,null,null,null,null,null,null,null,null,"MN102","No"]
[null,null,null,null,"",null,null,null,null,null,null,null,null,null,null,null,null,null,null,null,null,"MN103","No"]
[null,null,null,null,"",null,null,null,null,null,null,null,null,null,null,null,null,null,null,null,null,"MN105","No"]
[null,null,null,null,"",null,null,null,null,null,null,null,null,null,null,null,null,null,null,null,null,"MN107","No"]
[null,null,null,null,"",null,null,null,null,null,null,null,null,null,null,null,null,null,null,null,null,"MN108","No"]
[null,null,null,null,"",null,null,null,null,null,null,null,null,null,null,null,null,null,null,null,null,"MN113","No"]
[null,null,null,null,"",null,null,null,null,null,null,null,null,null,null,null,null,null,null,null,null,"MN117","No"]
[null,null,null,null,"",null,null,null,null,null,null,null,null,null,null,null,null,null,null,null,null,"MN128","No"]
[null,null,null,null,"",null,null,null,null,null,null,null,null,null,null,null,null,null,null,null,null,"MN144","No"]
[null,null,null,null,"",null,null,null,null,null,null,null,null,null,null,null,null,null,null,null,null,"MN147","No"]
[null,null,null,null,"",null,null,null,null,null,null,null,null,null,null,null,null,null,null,null,null,"MN151","No"]
[null,null,null,null,"",null,null,null,null,null,null,null,null,null,null,null,null,null,null,null,null,"MN152","No"]
[null,null,null,null,"",null,null,null,null,null,null,null,null,null,null,null,null,null,null,null,null,"MN154","No"]
[null,null,null,null,"",null,null,null,null,null,null,null,null,null,null,null,null,null,null,null,null,"MN157","No"]
[null,null,null,null,"",null,null,null,null,null,null,null,null,null,null,null,null,null,null,null,null,"MN158","No"]
[null,null,null,null,"",null,null,null,null,null,null,null,null,null,null,null,null,null,null,null,null,"MN161","No"]
[null,null,null,null,"",null,null,null,null,null,null,null,null,null,null,null,null,null,null,null,null,"MN163","No"]
[null,null,null,null,"",null,null,null,null,null,null,null,null,null,null,null,null,null,null,null,null,"MN164","No"]
[null,null,null,null,"",null,null,null,null,null,null,null,null,null,null,null,null,null,null,null,null,"MN167","No"]
[null,null,null,null,"",null,null,null,null,null,null,null,null,null,null,null,null,null,null,null,null,"MN169","No"]
[null,null,null,null,"",null,null,null,null,null,null,null,null,null,null,null,null,null,null,null,null,"MN172","No"]
[null,null,null,null,"",null,null,null,null,null,null,null,null,null,null,null,null,null,null,null,null,"MN176","No"]
[null,null,null,null,"",null,null,null,null,null,null,null,null,null,null,null,null,null,null,null,null,"MN177","No"]
[null,null,null,null,"",null,null,null,null,null,null,null,null,null,null,null,null,null,null,null,null,"MN178","No"]
[null,null,null,null,"",null,null,null,null,null,null,null,null,null,null,null,null,null,null,null,null,"MN180","No"]
[null,null,null,null,"",null,null,null,null,null,null,null,null,null,null,null,null,null,null,null,null,"MN183","No"]
[null,null,null,null,"",null,null,null,null,null,null,null,null,null,null,null,null,null,null,null,null,"MN184","No"]
[null,null,null,null,"",null,null,null,null,null,null,null,null,null,null,null,null,null,null,null,null,"MN188","No"]
[null,null,null,null,{"$f":"LEFT(F1539,2)","v":""},null,null,null,null,null,null,null,null,null,null,null,null,null,null,null,null,"MN190","No"]
[null,null,null,null,"",null,null,null,null,null,null,null,null,null,null,null,null,null,null,null,null,"MN191","No"]
[null,null,null,null,"",null,null,null,null,null,null,null,null,null,null,null,null,null,null,null,null,"MN192","No"]
[null,null,null,null,"",null,null,null,null,null,null,null,null,null,null,null,null,null,null,null,null,"MN197","No"]
[null,null,null,null,"",null,null,null,null,null,null,null,null,null,null,null,null,null,null,null,null,"MN206","No"]
[null,null,null,null,"",null,null,null,null,null,null,null,null,null,null,null,null,null,null,null,null,"MN208","No"]
[null,null,null,null,"",null,null,null,null,null,null,null,null,null,null,null,null,null,null,null,null,"MN211","Yes"]
[null,null,null,null,"",null,null,null,null,null,null,null,null,null,null,null,null,null,null,null,null,"MN212","Yes"]
[null,null,null,null,"",null,null,null,null,null,null,null,null,null,null,null,null,null,null,null,null,"MO001","Yes"]
[null,null,null,null,"",null,null,null,null,null,null,null,null,null,null,null,null,null,null,null,null,"MO002","No"]
[null,null,null,null,"",null,null,null,null,null,null,null,null,null,null,null,null,null,null,null,null,"MO003","No"]
[null,null,null,null,"",null,null,null,null,null,null,null,null,null,null,null,null,null,null,null,null,"MO004","Yes"]
[null,null,null,null,"",null,null,null,null,null,null,null,null,null,null,null,null,null,null,null,null,"MO006","No"]
[null,null,null,null,"",null,null,null,null,null,null,null,null,null,null,null,null,null,null,null,null,"MO007","No"]
[null,null,null,null,"",null,null,null,null,null,null,null,null,null,null,null,null,null,null,null,null,"MO008","No"]
[null,null,null,null,"",null,null,null,null,null,null,null,null,null,null,null,null,null,null,null,null,"MO009","No"]
[null,null,null,null,"",null,null,null,null,null,null,null,null,null,null,null,null,null,null,null,null,"MO010","No"]
[null,null,null,null,"",null,null,null,null,null,null,null,null,null,null,null,null,null,null,null,null,"MO011","No"]
[null,null,null,null,"",null,null,null,null,null,null,null,null,null,null,null,null,null,null,null,null,"MO012","No"]
[null,null,null,null,"",null,null,null,null,null,null,null,null,null,null,null,null,null,null,null,null,"MO013","No"]
[null,null,null,null,"",null,null,null,null,null,null,null,null,null,null,null,null,null,null,null,null,"MO014","No"]
[null,null,null,null,"",null,null,null,null,null,null,null,null,null,null,null,null,null,null,null,null,"MO016","No"]
[null,null,null,null,"",null,null,null,null,null,null,null,null,null,null,null,null,null,null,null,null,"MO017","No"]
[null,null,null,null,"",null,null,null,null,null,null,null,null,null,null,null,null,null,null,null,null,"MO018","No"]
[null,null,null,null,"",null,null,null,null,null,null,null,null,null,null,null,null,null,null,null,null,"MO019","No"]
[null,null,null,null,"",null,null,null,null,null,null,null,null,null,null,null,null,null,null,null,null,"MO020","No"]
[null,null,null,null,"",null,null,null,null,null,null,null,null,null,null,null,null,null,null,null,null,"MO021","No"]
[null,null,null,null,"",null,null,null,null,null,null,null,null,null,null,null,null,null,null,null,null,"MO022","No"]
[null,null,null,null,"",null,null,null,null,null,null,null,null,null,null,null,null,null,null,null,null,"MO023","No"]
[null,null,null,null,"",null,null,null,null,null,null,null,null,null,null,null,null,null,null,null,null,"MO024","No"]
[null,null,null,null,"",null,null,null,null,null,null,null,null,null,null,null,null,null,null,null,null,"MO025","No"]
[null,null,null,null,"",null,null,null,null,null,null,null,null,null,null,null,null,null,null,null,null,"MO026","No"]
[null,null,null,null,"",null,null,null,null,null,null,null,null,null,null,null,null,null,null,null,null,"MO027","No"]
[null,null,null,null,"",null,null,null,null,null,null,null,null,null,null,null,null,null,null,null,null,"MO028","No"]
[null,null,null,null,"",null,null,null,null,null,null,null,null,null,null,null,null,null,null,null,null,"MO029","No"]
[null,null,null,null,"",null,null,null,null,null,null,null,null,null,null,null,null,null,null,null,null,"MO030","No"]
[null,null,null,null,"",null,null,null,null,null,null,null,null,null,null,null,null,null,null,null,null,"MO031","No"]
[null,null,null,null,"",null,null,null,null,null,null,null,null,null,null,null,null,null,null,null,null,"MO032","No"]
[null,null,null,null,"",null,null,null,null,null,null,null,null,null,null,null,null,null,null,null,null,"MO033","No"]
[null,null,null,null,"",null,null,null,null,null,null,null,null,null,null,null,null,null,null,null,null,"MO034","No"]
[null,null,null,null,"",null,null,null,null,null,null,null,null,null,null,null,null,null,null,null,null,"MO035","No"]
[null,null,null,null,"",null,null,null,null,null,null,null,null,null,null,null,null,null,null,null,null,"MO036","No"]
[null,null,null,null,"",null,null,null,null,null,null,null,null,null,null,null,null,null,null,null,null,"MO037","No"]
[null,null,null,null,"",null,null,null,null,null,null,null,null,null,null,null,null,null,null,null,null,"MO038","No"]
[null,null,null,null,"",null,null,null,null,null,null,null,null,null,null,null,null,null,null,null,null,"MO039","No"]
[null,null,null,null,"",null,null,null,null,null,null,null,null,null,null,null,null,null,null,null,null,"MO040","No"]
[null,null,null,null,"",null,null,null,null,null,null,null,null,null,null,null,null,null,null,null,null,"MO041","No"]
[null,null,null,null,"",null,null,null,null,null,null,null,null,null,null,null,null,null,null,null,null,"MO042","No"]
[null,null,null,null,"",null,null,null,null,null,null,null,null,null,null,null,null,null,null,null,null,"MO043","No"]
[null,null,null,null,"",null,null,null,null,null,null,null,null,null,null,null,null,null,null,null,null,"MO044","No"]
[null,null,null,null,"",null,null,null,null,null,null,null,null,null,null,null,null,null,null,null,null,"MO045","No"]
[null,null,null,null,"",null,null,null,null,null,null,null,null,null,null,null,null,null,null,null,null,"MO046","No"]
[null,null,null,null,"",null,null,null,null,null,null,null,null,null,null,null,null,null,null,null,null,"MO047","No"]
[null,null,null,null,"",null,null,null,null,null,null,null,null,null,null,null,null,null,null,null,null,"MO048","No"]
[null,null,null,null,"",null,null,null,null,null,null,null,null,null,null,null,null,null,null,null,null,"MO049","No"]
[null,null,null,null,"",null,null,null,null,null,null,null,null,null,null,null,null,null,null,null,null,"MO050","No"]
[null,null,null,null,"",null,null,null,null,null,null,null,null,null,null,null,null,null,null,null,null,"MO051","No"]
[null,null,null,null,"",null,null,null,null,null,null,null,null,null,null,null,null,null,null,null,null,"MO052","No"]
[null,null,null,null,"",null,null,null,null,null,null,null,null,null,null,null,null,null,null,null,null,"MO053","No"]
[null,null,null,null,"",null,null,null,null,null,null,null,null,null,null,null,null,null,null,null,null,"MO054","No"]
[null,null,null,null,"",null,null,null,null,null,null,null,null,null,null,null,null,null,null,null,null,"MO056","No"]
[null,null,null,null,"",null,null,null,null,null,null,null,null,null,null,null,null,null,null,null,null,"MO057","No"]
[null,null,null,null,"",null,null,null,null,null,null,null,null,null,null,null,null,null,null,null,null,"MO058","No"]
[null,null,null,null,"",null,null,null,null,null,null,null,null,null,null,null,null,null,null,null,null,"MO059","No"]
[null,null,null,null,{"$f":"LEFT(F1603,2)","v":""},null,null,null,null,null,null,null,null,null,null,null,null,null,null,null,null,"MO060","No"]
[null,null,null,null,"",null,null,null,null,null,null,null,null,null,null,null,null,null,null,null,null,"MO061","No"]
[null,null,null,null,"",null,null,null,null,null,null,null,null,null,null,null,null,null,null,null,null,"MO062","No"]
[null,null,null,null,"",null,null,null,null,null,null,null,null,null,null,null,null,null,null,null,null,"MO063","No"]
[null,null,null,null,"",null,null,null,null,null,null,null,null,null,null,null,null,null,null,null,null,"MO064","No"]
[null,null,null,null,"",null,null,null,null,null,null,null,null,null,null,null,null,null,null,null,null,"MO065","No"]
[null,null,null,null,"",null,null,null,null,null,null,null,null,null,null,null,null,null,null,null,null,"MO066","No"]
[null,null,null,null,"",null,null,null,null,null,null,null,null,null,null,null,null,null,null,null,null,"MO067","No"]
[null,null,null,null,"",null,null,null,null,null,null,null,null,null,null,null,null,null,null,null,null,"MO068","No"]
[null,null,null,null,"",null,null,null,null,null,null,null,null,null,null,null,null,null,null,null,null,"MO069","No"]
[null,null,null,null,"",null,null,null,null,null,null,null,null,null,null,null,null,null,null,null,null,"MO070","No"]
[null,null,null,null,"",null,null,null,null,null,null,null,null,null,null,null,null,null,null,null,null,"MO071","No"]
[null,null,null,null,"",null,null,null,null,null,null,null,null,null,null,null,null,null,null,null,null,"MO072","No"]
[null,null,null,null,"",null,null,null,null,null,null,null,null,null,null,null,null,null,null,null,null,"MO073","No"]
[null,null,null,null,"",null,null,null,null,null,null,null,null,null,null,null,null,null,null,null,null,"MO074","No"]
[null,null,null,null,"",null,null,null,null,null,null,null,null,null,null,null,null,null,null,null,null,"MO075","No"]
[null,null,null,null,"",null,null,null,null,null,null,null,null,null,null,null,null,null,null,null,null,"MO076","No"]
[null,null,null,null,"",null,null,null,null,null,null,null,null,null,null,null,null,null,null,null,null,"MO077","No"]
[null,null,null,null,"",null,null,null,null,null,null,null,null,null,null,null,null,null,null,null,null,"MO078","No"]
[null,null,null,null,"",null,null,null,null,null,null,null,null,null,null,null,null,null,null,null,null,"MO079","No"]
[null,null,null,null,"",null,null,null,null,null,null,null,null,null,null,null,null,null,null,null,null,"MO081","No"]
[null,null,null,null,"",null,null,null,null,null,null,null,null,null,null,null,null,null,null,null,null,"MO090","No"]
[null,null,null,null,"",null,null,null,null,null,null,null,null,null,null,null,null,null,null,null,null,"MO092","No"]
[null,null,null,null,"",null,null,null,null,null,null,null,null,null,null,null,null,null,null,null,null,"MO096","No"]
[null,null,null,null,"",null,null,null,null,null,null,null,null,null,null,null,null,null,null,null,null,"MO098","No"]
[null,null,null,null,"",null,null,null,null,null,null,null,null,null,null,null,null,null,null,null,null,"MO103","No"]
[null,null,null,null,"",null,null,null,null,null,null,null,null,null,null,null,null,null,null,null,null,"MO107","No"]
[null,null,null,null,"",null,null,null,null,null,null,null,null,null,null,null,null,null,null,null,null,"MO110","No"]
[null,null,null,null,"",null,null,null,null,null,null,null,null,null,null,null,null,null,null,null,null,"MO111","No"]
[null,null,null,null,"",null,null,null,null,null,null,null,null,null,null,null,null,null,null,null,null,"MO125","No"]
[null,null,null,null,"",null,null,null,null,null,null,null,null,null,null,null,null,null,null,null,null,"MO129","No"]
[null,null,null,null,"",null,null,null,null,null,null,null,null,null,null,null,null,null,null,null,null,"MO132","No"]
[null,null,null,null,"",null,null,null,null,null,null,null,null,null,null,null,null,null,null,null,null,"MO133","No"]
[null,null,null,null,"",null,null,null,null,null,null,null,null,null,null,null,null,null,null,null,null,"MO138","No"]
[null,null,null,null,"",null,null,null,null,null,null,null,null,null,null,null,null,null,null,null,null,"MO145","No"]
[null,null,null,null,"",null,null,null,null,null,null,null,null,null,null,null,null,null,null,null,null,"MO146","No"]
[null,null,null,null,"",null,null,null,null,null,null,null,null,null,null,null,null,null,null,null,null,"MO147","No"]
[null,null,null,null,"",null,null,null,null,null,null,null,null,null,null,null,null,null,null,null,null,"MO149","No"]
[null,null,null,null,"",null,null,null,null,null,null,null,null,null,null,null,null,null,null,null,null,"MO156","No"]
[null,null,null,null,"",null,null,null,null,null,null,null,null,null,null,null,null,null,null,null,null,"MO179","No"]
[null,null,null,null,"",null,null,null,null,null,null,null,null,null,null,null,null,null,null,null,null,"MO187","No"]
[null,null,null,null,"",null,null,null,null,null,null,null,null,null,null,null,null,null,null,null,null,"MO188","No"]
[null,null,null,null,"",null,null,null,null,null,null,null,null,null,null,null,null,null,null,null,null,"MO189","No"]
[null,null,null,null,"",null,null,null,null,null,null,null,null,null,null,null,null,null,null,null,null,"MO191","No"]
[null,null,null,null,"",null,null,null,null,null,null,null,null,null,null,null,null,null,null,null,null,"MO192","No"]
[null,null,null,null,"",null,null,null,null,null,null,null,null,null,null,null,null,null,null,null,null,"MO209","No"]
[null,null,null,null,"",null,null,null,null,null,null,null,null,null,null,null,null,null,null,null,null,"MO218","No"]
[null,null,null,null,"",null,null,null,null,null,null,null,null,null,null,null,null,null,null,null,null,"MO220","No"]
[null,null,null,null,"",null,null,null,null,null,null,null,null,null,null,null,null,null,null,null,null,"MO221","No"]
[null,null,null,null,"",null,null,null,null,null,null,null,null,null,null,null,null,null,null,null,null,"MO223","No"]
[null,null,null,null,"",null,null,null,null,null,null,null,null,null,null,null,null,null,null,null,null,"MS001","No"]
[null,null,null,null,"",null,null,null,null,null,null,null,null,null,null,null,null,null,null,null,null,"MS002","Yes"]
[null,null,null,null,"",null,null,null,null,null,null,null,null,null,null,null,null,null,null,null,null,"MS003","Yes"]
[null,null,null,null,"",null,null,null,null,null,null,null,null,null,null,null,null,null,null,null,null,"MS004","Yes"]
[null,null,null,null,"",null,null,null,null,null,null,null,null,null,null,null,null,null,null,null,null,"MS005","No"]
[null,null,null,null,"",null,null,null,null,null,null,null,null,null,null,null,null,null,null,null,null,"MS006","No"]
[null,null,null,null,"",null,null,null,null,null,null,null,null,null,null,null,null,null,null,null,null,"MS007","No"]
[null,null,null,null,"",null,null,null,null,null,null,null,null,null,null,null,null,null,null,null,null,"MS019","Yes"]
[null,null,null,null,"",null,null,null,null,null,null,null,null,null,null,null,null,null,null,null,null,"MS030","No"]
[null,null,null,null,"",null,null,null,null,null,null,null,null,null,null,null,null,null,null,null,null,"MS040","No"]
[null,null,null,null,"",null,null,null,null,null,null,null,null,null,null,null,null,null,null,null,null,"MS047","No"]
[null,null,null,null,"",null,null,null,null,null,null,null,null,null,null,null,null,null,null,null,null,"MS057","No"]
[null,null,null,null,"",null,null,null,null,null,null,null,null,null,null,null,null,null,null,null,null,"MS058","No"]
[null,null,null,null,"",null,null,null,null,null,null,null,null,null,null,null,null,null,null,null,null,"MS059","No"]
[null,null,null,null,{"$f":"LEFT(F1667,2)","v":""},null,null,null,null,null,null,null,null,null,null,null,null,null,null,null,null,"MS060","No"]
[null,null,null,null,"",null,null,null,null,null,null,null,null,null,null,null,null,null,null,null,null,"MS061","No"]
[null,null,null,null,"",null,null,null,null,null,null,null,null,null,null,null,null,null,null,null,null,"MS062","No"]
[null,null,null,null,"",null,null,null,null,null,null,null,null,null,null,null,null,null,null,null,null,"MS063","No"]
[null,null,null,null,"",null,null,null,null,null,null,null,null,null,null,null,null,null,null,null,null,"MS064","No"]
[null,null,null,null,"",null,null,null,null,null,null,null,null,null,null,null,null,null,null,null,null,"MS065","No"]
[null,null,null,null,"",null,null,null,null,null,null,null,null,null,null,null,null,null,null,null,null,"MS066","No"]
[null,null,null,null,"",null,null,null,null,null,null,null,null,null,null,null,null,null,null,null,null,"MS067","No"]
[null,null,null,null,"",null,null,null,null,null,null,null,null,null,null,null,null,null,null,null,null,"MS068","No"]
[null,null,null,null,"",null,null,null,null,null,null,null,null,null,null,null,null,null,null,null,null,"MS070","No"]
[null,null,null,null,"",null,null,null,null,null,null,null,null,null,null,null,null,null,null,null,null,"MS071","No"]
[null,null,null,null,"",null,null,null,null,null,null,null,null,null,null,null,null,null,null,null,null,"MS072","No"]
[null,null,null,null,"",null,null,null,null,null,null,null,null,null,null,null,null,null,null,null,null,"MS075","No"]
[null,null,null,null,"",null,null,null,null,null,null,null,null,null,null,null,null,null,null,null,null,"MS076","No"]
[null,null,null,null,"",null,null,null,null,null,null,null,null,null,null,null,null,null,null,null,null,"MS077","No"]
[null,null,null,null,"",null,null,null,null,null,null,null,null,null,null,null,null,null,null,null,null,"MS078","No"]
[null,null,null,null,"",null,null,null,null,null,null,null,null,null,null,null,null,null,null,null,null,"MS079","No"]
[null,null,null,null,"",null,null,null,null,null,null,null,null,null,null,null,null,null,null,null,null,"MS080","No"]
[null,null,null,null,"",null,null,null,null,null,null,null,null,null,null,null,null,null,null,null,null,"MS081","No"]
[null,null,null,null,"",null,null,null,null,null,null,null,null,null,null,null,null,null,null,null,null,"MS082","No"]
[null,null,null,null,"",null,null,null,null,null,null,null,null,null,null,null,null,null,null,null,null,"MS083","No"]
[null,null,null,null,"",null,null,null,null,null,null,null,null,null,null,null,null,null,null,null,null,"MS084","No"]
[null,null,null,null,"",null,null,null,null,null,null,null,null,null,null,null,null,null,null,null,null,"MS085","No"]
[null,null,null,null,"",null,null,null,null,null,null,null,null,null,null,null,null,null,null,null,null,"MS086","No"]
[null,null,null,null,"",null,null,null,null,null,null,null,null,null,null,null,null,null,null,null,null,"MS089","No"]
[null,null,null,null,"",null,null,null,null,null,null,null,null,null,null,null,null,null,null,null,null,"MS090","No"]
[null,null,null,null,"",null,null,null,null,null,null,null,null,null,null,null,null,null,null,null,null,"MS093","No"]
[null,null,null,null,"",null,null,null,null,null,null,null,null,null,null,null,null,null,null,null,null,"MS094","No"]
[null,null,null,null,"",null,null,null,null,null,null,null,null,null,null,null,null,null,null,null,null,"MS096","No"]
[null,null,null,null,"",null,null,null,null,null,null,null,null,null,null,null,null,null,null,null,null,"MS099","No"]
[null,null,null,null,"",null,null,null,null,null,null,null,null,null,null,null,null,null,null,null,null,"MS101","No"]
[null,null,null,null,"",null,null,null,null,null,null,null,null,null,null,null,null,null,null,null,null,"MS103","No"]
[null,null,null,null,"",null,null,null,null,null,null,null,null,null,null,null,null,null,null,null,null,"MS105","No"]
[null,null,null,null,"",null,null,null,null,null,null,null,null,null,null,null,null,null,null,null,null,"MS107","No"]
[null,null,null,null,"",null,null,null,null,null,null,null,null,null,null,null,null,null,null,null,null,"MS109","No"]
[null,null,null,null,"",null,null,null,null,null,null,null,null,null,null,null,null,null,null,null,null,"MS110","No"]
[null,null,null,null,"",null,null,null,null,null,null,null,null,null,null,null,null,null,null,null,null,"MS111","No"]
[null,null,null,null,"",null,null,null,null,null,null,null,null,null,null,null,null,null,null,null,null,"MS117","No"]
[null,null,null,null,"",null,null,null,null,null,null,null,null,null,null,null,null,null,null,null,null,"MS121","No"]
[null,null,null,null,"",null,null,null,null,null,null,null,null,null,null,null,null,null,null,null,null,"MT001","No"]
[null,null,null,null,"",null,null,null,null,null,null,null,null,null,null,null,null,null,null,null,null,"MT002","No"]
[null,null,null,null,"",null,null,null,null,null,null,null,null,null,null,null,null,null,null,null,null,"MT003","No"]
[null,null,null,null,"",null,null,null,null,null,null,null,null,null,null,null,null,null,null,null,null,"MT004","No"]
[null,null,null,null,"",null,null,null,null,null,null,null,null,null,null,null,null,null,null,null,null,"MT005","No"]
[null,null,null,null,"",null,null,null,null,null,null,null,null,null,null,null,null,null,null,null,null,"MT006","No"]
[null,null,null,null,"",null,null,null,null,null,null,null,null,null,null,null,null,null,null,null,null,"MT007","No"]
[null,null,null,null,"",null,null,null,null,null,null,null,null,null,null,null,null,null,null,null,null,"MT015","No"]
[null,null,null,null,"",null,null,null,null,null,null,null,null,null,null,null,null,null,null,null,null,"MT029","No"]
[null,null,null,null,"",null,null,null,null,null,null,null,null,null,null,null,null,null,null,null,null,"MT033","No"]
[null,null,null,null,"",null,null,null,null,null,null,null,null,null,null,null,null,null,null,null,null,"NC001","No"]
[null,null,null,null,"",null,null,null,null,null,null,null,null,null,null,null,null,null,null,null,null,"NC002","No"]
[null,null,null,null,"",null,null,null,null,null,null,null,null,null,null,null,null,null,null,null,null,"NC003","No"]
[null,null,null,null,"",null,null,null,null,null,null,null,null,null,null,null,null,null,null,null,null,"NC004","No"]
[null,null,null,null,"",null,null,null,null,null,null,null,null,null,null,null,null,null,null,null,null,"NC005","Yes"]
[null,null,null,null,"",null,null,null,null,null,null,null,null,null,null,null,null,null,null,null,null,"NC006","No"]
[null,null,null,null,"",null,null,null,null,null,null,null,null,null,null,null,null,null,null,null,null,"NC007","No"]
[null,null,null,null,"",null,null,null,null,null,null,null,null,null,null,null,null,null,null,null,null,"NC008","No"]
[null,null,null,null,"",null,null,null,null,null,null,null,null,null,null,null,null,null,null,null,null,"NC009","Yes"]
[null,null,null,null,"",null,null,null,null,null,null,null,null,null,null,null,null,null,null,null,null,"NC010","Yes"]
[null,null,null,null,"",null,null,null,null,null,null,null,null,null,null,null,null,null,null,null,null,"NC011","No"]
[null,null,null,null,"",null,null,null,null,null,null,null,null,null,null,null,null,null,null,null,null,"NC012","No"]
[null,null,null,null,"",null,null,null,null,null,null,null,null,null,null,null,null,null,null,null,null,"NC013","No"]
[null,null,null,null,"",null,null,null,null,null,null,null,null,null,null,null,null,null,null,null,null,"NC014","No"]
[null,null,null,null,"",null,null,null,null,null,null,null,null,null,null,null,null,null,null,null,null,"NC015","No"]
[null,null,null,null,{"$f":"LEFT(F1731,2)","v":""},null,null,null,null,null,null,null,null,null,null,null,null,null,null,null,null,"NC016","No"]
[null,null,null,null,"",null,null,null,null,null,null,null,null,null,null,null,null,null,null,null,null,"NC017","No"]
[null,null,null,null,"",null,null,null,null,null,null,null,null,null,null,null,null,null,null,null,null,"NC018","No"]
[null,null,null,null,"",null,null,null,null,null,null,null,null,null,null,null,null,null,null,null,null,"NC019","No"]
[null,null,null,null,"",null,null,null,null,null,null,null,null,null,null,null,null,null,null,null,null,"NC020","No"]
[null,null,null,null,"",null,null,null,null,null,null,null,null,null,null,null,null,null,null,null,null,"NC021","No"]
[null,null,null,null,"",null,null,null,null,null,null,null,null,null,null,null,null,null,null,null,null,"NC022","No"]
[null,null,null,null,"",null,null,null,null,null,null,null,null,null,null,null,null,null,null,null,null,"NC023","No"]
[null,null,null,null,"",null,null,null,null,null,null,null,null,null,null,null,null,null,null,null,null,"NC024","No"]
[null,null,null,null,"",null,null,null,null,null,null,null,null,null,null,null,null,null,null,null,null,"NC025","No"]
[null,null,null,null,"",null,null,null,null,null,null,null,null,null,null,null,null,null,null,null,null,"NC026","No"]
[null,null,null,null,"",null,null,null,null,null,null,null,null,null,null,null,null,null,null,null,null,"NC027","No"]
[null,null,null,null,"",null,null,null,null,null,null,null,null,null,null,null,null,null,null,null,null,"NC028","No"]
[null,null,null,null,"",null,null,null,null,null,null,null,null,null,null,null,null,null,null,null,null,"NC029","No"]
[null,null,null,null,"",null,null,null,null,null,null,null,null,null,null,null,null,null,null,null,null,"NC030","No"]
[null,null,null,null,"",null,null,null,null,null,null,null,null,null,null,null,null,null,null,null,null,"NC031","No"]
[null,null,null,null,"",null,null,null,null,null,null,null,null,null,null,null,null,null,null,null,null,"NC032","No"]
[null,null,null,null,"",null,null,null,null,null,null,null,null,null,null,null,null,null,null,null,null,"NC033","No"]
[null,null,null,null,"",null,null,null,null,null,null,null,null,null,null,null,null,null,null,null,null,"NC034","No"]
[null,null,null,null,"",null,null,null,null,null,null,null,null,null,null,null,null,null,null,null,null,"NC035","No"]
[null,null,null,null,"",null,null,null,null,null,null,null,null,null,null,null,null,null,null,null,null,"NC036","No"]
[null,null,null,null,"",null,null,null,null,null,null,null,null,null,null,null,null,null,null,null,null,"NC037","No"]
[null,null,null,null,"",null,null,null,null,null,null,null,null,null,null,null,null,null,null,null,null,"NC039","No"]
[null,null,null,null,"",null,null,null,null,null,null,null,null,null,null,null,null,null,null,null,null,"NC040","No"]
[null,null,null,null,"",null,null,null,null,null,null,null,null,null,null,null,null,null,null,null,null,"NC043","No"]
[null,null,null,null,"",null,null,null,null,null,null,null,null,null,null,null,null,null,null,null,null,"NC044","No"]
[null,null,null,null,"",null,null,null,null,null,null,null,null,null,null,null,null,null,null,null,null,"NC045","No"]
[null,null,null,null,"",null,null,null,null,null,null,null,null,null,null,null,null,null,null,null,null,"NC046","No"]
[null,null,null,null,"",null,null,null,null,null,null,null,null,null,null,null,null,null,null,null,null,"NC047","No"]
[null,null,null,null,"",null,null,null,null,null,null,null,null,null,null,null,null,null,null,null,null,"NC048","No"]
[null,null,null,null,"",null,null,null,null,null,null,null,null,null,null,null,null,null,null,null,null,"NC049","No"]
[null,null,null,null,"",null,null,null,null,null,null,null,null,null,null,null,null,null,null,null,null,"NC050","No"]
[null,null,null,null,"",null,null,null,null,null,null,null,null,null,null,null,null,null,null,null,null,"NC051","No"]
[null,null,null,null,"",null,null,null,null,null,null,null,null,null,null,null,null,null,null,null,null,"NC052","No"]
[null,null,null,null,"",null,null,null,null,null,null,null,null,null,null,null,null,null,null,null,null,"NC053","No"]
[null,null,null,null,"",null,null,null,null,null,null,null,null,null,null,null,null,null,null,null,null,"NC054","No"]
[null,null,null,null,"",null,null,null,null,null,null,null,null,null,null,null,null,null,null,null,null,"NC055","No"]
[null,null,null,null,"",null,null,null,null,null,null,null,null,null,null,null,null,null,null,null,null,"NC056","No"]
[null,null,null,null,"",null,null,null,null,null,null,null,null,null,null,null,null,null,null,null,null,"NC057","No"]
[null,null,null,null,"",null,null,null,null,null,null,null,null,null,null,null,null,null,null,null,null,"NC058","No"]
[null,null,null,null,"",null,null,null,null,null,null,null,null,null,null,null,null,null,null,null,null,"NC059","No"]
[null,null,null,null,"",null,null,null,null,null,null,null,null,null,null,null,null,null,null,null,null,"NC060","No"]
[null,null,null,null,"",null,null,null,null,null,null,null,null,null,null,null,null,null,null,null,null,"NC061","No"]
[null,null,null,null,"",null,null,null,null,null,null,null,null,null,null,null,null,null,null,null,null,"NC062","No"]
[null,null,null,null,"",null,null,null,null,null,null,null,null,null,null,null,null,null,null,null,null,"NC063","No"]
[null,null,null,null,"",null,null,null,null,null,null,null,null,null,null,null,null,null,null,null,null,"NC064","No"]
[null,null,null,null,"",null,null,null,null,null,null,null,null,null,null,null,null,null,null,null,null,"NC065","No"]
[null,null,null,null,"",null,null,null,null,null,null,null,null,null,null,null,null,null,null,null,null,"NC066","No"]
[null,null,null,null,"",null,null,null,null,null,null,null,null,null,null,null,null,null,null,null,null,"NC067","No"]
[null,null,null,null,"",null,null,null,null,null,null,null,null,null,null,null,null,null,null,null,null,"NC068","No"]
[null,null,null,null,"",null,null,null,null,null,null,null,null,null,null,null,null,null,null,null,null,"NC069","No"]
[null,null,null,null,"",null,null,null,null,null,null,null,null,null,null,null,null,null,null,null,null,"NC070","No"]
[null,null,null,null,"",null,null,null,null,null,null,null,null,null,null,null,null,null,null,null,null,"NC071","No"]
[null,null,null,null,"",null,null,null,null,null,null,null,null,null,null,null,null,null,null,null,null,"NC072","No"]
[null,null,null,null,"",null,null,null,null,null,null,null,null,null,null,null,null,null,null,null,null,"NC073","No"]
[null,null,null,null,"",null,null,null,null,null,null,null,null,null,null,null,null,null,null,null,null,"NC074","No"]
[null,null,null,null,"",null,null,null,null,null,null,null,null,null,null,null,null,null,null,null,null,"NC075","No"]
[null,null,null,null,"",null,null,null,null,null,null,null,null,null,null,null,null,null,null,null,null,"NC076","No"]
[null,null,null,null,"",null,null,null,null,null,null,null,null,null,null,null,null,null,null,null,null,"NC077","No"]
[null,null,null,null,"",null,null,null,null,null,null,null,null,null,null,null,null,null,null,null,null,"NC078","No"]
[null,null,null,null,"",null,null,null,null,null,null,null,null,null,null,null,null,null,null,null,null,"NC079","No"]
[null,null,null,null,"",null,null,null,null,null,null,null,null,null,null,null,null,null,null,null,null,"NC080","No"]
[null,null,null,null,"",null,null,null,null,null,null,null,null,null,null,null,null,null,null,null,null,"NC081","No"]
[null,null,null,null,"",null,null,null,null,null,null,null,null,null,null,null,null,null,null,null,null,"NC082","No"]
[null,null,null,null,{"$f":"LEFT(F1795,2)","v":""},null,null,null,null,null,null,null,null,null,null,null,null,null,null,null,null,"NC084","No"]
[null,null,null,null,"",null,null,null,null,null,null,null,null,null,null,null,null,null,null,null,null,"NC085","No"]
[null,null,null,null,"",null,null,null,null,null,null,null,null,null,null,null,null,null,null,null,null,"NC087","No"]
[null,null,null,null,"",null,null,null,null,null,null,null,null,null,null,null,null,null,null,null,null,"NC088","No"]
[null,null,null,null,"",null,null,null,null,null,null,null,null,null,null,null,null,null,null,null,null,"NC089","No"]
[null,null,null,null,"",null,null,null,null,null,null,null,null,null,null,null,null,null,null,null,null,"NC090","No"]
[null,null,null,null,"",null,null,null,null,null,null,null,null,null,null,null,null,null,null,null,null,"NC092","No"]
[null,null,null,null,"",null,null,null,null,null,null,null,null,null,null,null,null,null,null,null,null,"NC093","No"]
[null,null,null,null,"",null,null,null,null,null,null,null,null,null,null,null,null,null,null,null,null,"NC095","No"]
[null,null,null,null,"",null,null,null,null,null,null,null,null,null,null,null,null,null,null,null,null,"NC098","No"]
[null,null,null,null,"",null,null,null,null,null,null,null,null,null,null,null,null,null,null,null,null,"NC102","No"]
[null,null,null,null,"",null,null,null,null,null,null,null,null,null,null,null,null,null,null,null,null,"NC105","No"]
[null,null,null,null,"",null,null,null,null,null,null,null,null,null,null,null,null,null,null,null,null,"NC114","No"]
[null,null,null,null,"",null,null,null,null,null,null,null,null,null,null,null,null,null,null,null,null,"NC117","No"]
[null,null,null,null,"",null,null,null,null,null,null,null,null,null,null,null,null,null,null,null,null,"NC118","No"]
[null,null,null,null,"",null,null,null,null,null,null,null,null,null,null,null,null,null,null,null,null,"NC119","No"]
[null,null,null,null,"",null,null,null,null,null,null,null,null,null,null,null,null,null,null,null,null,"NC167","No"]
[null,null,null,null,"",null,null,null,null,null,null,null,null,null,null,null,null,null,null,null,null,"NC169","No"]
[null,null,null,null,"",null,null,null,null,null,null,null,null,null,null,null,null,null,null,null,null,"NC174","No"]
[null,null,null,null,"",null,null,null,null,null,null,null,null,null,null,null,null,null,null,null,null,"NC175","No"]
[null,null,null,null,"",null,null,null,null,null,null,null,null,null,null,null,null,null,null,null,null,"ND001","No"]
[null,null,null,null,"",null,null,null,null,null,null,null,null,null,null,null,null,null,null,null,null,"ND002","No"]
[null,null,null,null,"",null,null,null,null,null,null,null,null,null,null,null,null,null,null,null,null,"ND003","No"]
[null,null,null,null,"",null,null,null,null,null,null,null,null,null,null,null,null,null,null,null,null,"ND009","No"]
[null,null,null,null,"",null,null,null,null,null,null,null,null,null,null,null,null,null,null,null,null,"ND013","No"]
[null,null,null,null,"",null,null,null,null,null,null,null,null,null,null,null,null,null,null,null,null,"ND014","Yes"]
[null,null,null,null,"",null,null,null,null,null,null,null,null,null,null,null,null,null,null,null,null,"ND015","No"]
[null,null,null,null,"",null,null,null,null,null,null,null,null,null,null,null,null,null,null,null,null,"ND017","No"]
[null,null,null,null,"",null,null,null,null,null,null,null,null,null,null,null,null,null,null,null,null,"ND019","No"]
[null,null,null,null,"",null,null,null,null,null,null,null,null,null,null,null,null,null,null,null,null,"ND021","No"]
[null,null,null,null,"",null,null,null,null,null,null,null,null,null,null,null,null,null,null,null,null,"ND022","No"]
[null,null,null,null,"",null,null,null,null,null,null,null,null,null,null,null,null,null,null,null,null,"ND030","No"]
[null,null,null,null,"",null,null,null,null,null,null,null,null,null,null,null,null,null,null,null,null,"ND039","No"]
[null,null,null,null,"",null,null,null,null,null,null,null,null,null,null,null,null,null,null,null,null,"ND054","Yes"]
[null,null,null,null,"",null,null,null,null,null,null,null,null,null,null,null,null,null,null,null,null,"ND058","No"]
[null,null,null,null,"",null,null,null,null,null,null,null,null,null,null,null,null,null,null,null,null,"NE001","No"]
[null,null,null,null,"",null,null,null,null,null,null,null,null,null,null,null,null,null,null,null,null,"NE002","No"]
[null,null,null,null,"",null,null,null,null,null,null,null,null,null,null,null,null,null,null,null,null,"NE003","No"]
[null,null,null,null,"",null,null,null,null,null,null,null,null,null,null,null,null,null,null,null,null,"NE004","No"]
[null,null,null,null,"",null,null,null,null,null,null,null,null,null,null,null,null,null,null,null,null,"NE005","No"]
[null,null,null,null,"",null,null,null,null,null,null,null,null,null,null,null,null,null,null,null,null,"NE006","No"]
[null,null,null,null,"",null,null,null,null,null,null,null,null,null,null,null,null,null,null,null,null,"NE008","No"]
[null,null,null,null,"",null,null,null,null,null,null,null,null,null,null,null,null,null,null,null,null,"NE010","No"]
[null,null,null,null,"",null,null,null,null,null,null,null,null,null,null,null,null,null,null,null,null,"NE011","No"]
[null,null,null,null,"",null,null,null,null,null,null,null,null,null,null,null,null,null,null,null,null,"NE012","No"]
[null,null,null,null,"",null,null,null,null,null,null,null,null,null,null,null,null,null,null,null,null,"NE014","No"]
[null,null,null,null,"",null,null,null,null,null,null,null,null,null,null,null,null,null,null,null,null,"NE015","No"]
[null,null,null,null,"",null,null,null,null,null,null,null,null,null,null,null,null,null,null,null,null,"NE016","No"]
[null,null,null,null,"",null,null,null,null,null,null,null,null,null,null,null,null,null,null,null,null,"NE017","No"]
[null,null,null,null,"",null,null,null,null,null,null,null,null,null,null,null,null,null,null,null,null,"NE018","No"]
[null,null,null,null,"",null,null,null,null,null,null,null,null,null,null,null,null,null,null,null,null,"NE019","No"]
[null,null,null,null,"",null,null,null,null,null,null,null,null,null,null,null,null,null,null,null,null,"NE020","No"]
[null,null,null,null,"",null,null,null,null,null,null,null,null,null,null,null,null,null,null,null,null,"NE021","No"]
[null,null,null,null,"",null,null,null,null,null,null,null,null,null,null,null,null,null,null,null,null,"NE022","No"]
[null,null,null,null,"",null,null,null,null,null,null,null,null,null,null,null,null,null,null,null,null,"NE023","No"]
[null,null,null,null,"",null,null,null,null,null,null,null,null,null,null,null,null,null,null,null,null,"NE024","No"]
[null,null,null,null,"",null,null,null,null,null,null,null,null,null,null,null,null,null,null,null,null,"NE025","No"]
[null,null,null,null,"",null,null,null,null,null,null,null,null,null,null,null,null,null,null,null,null,"NE026","No"]
[null,null,null,null,"",null,null,null,null,null,null,null,null,null,null,null,null,null,null,null,null,"NE027","No"]
[null,null,null,null,"",null,null,null,null,null,null,null,null,null,null,null,null,null,null,null,null,"NE028","No"]
[null,null,null,null,"",null,null,null,null,null,null,null,null,null,null,null,null,null,null,null,null,"NE029","No"]
[null,null,null,null,"",null,null,null,null,null,null,null,null,null,null,null,null,null,null,null,null,"NE030","No"]
[null,null,null,null,"",null,null,null,null,null,null,null,null,null,null,null,null,null,null,null,null,"NE031","No"]
[null,null,null,null,"",null,null,null,null,null,null,null,null,null,null,null,null,null,null,null,null,"NE032","No"]
[null,null,null,null,{"$f":"LEFT(F1859,2)","v":""},null,null,null,null,null,null,null,null,null,null,null,null,null,null,null,null,"NE033","No"]
[null,null,null,null,"",null,null,null,null,null,null,null,null,null,null,null,null,null,null,null,null,"NE034","No"]
[null,null,null,null,"",null,null,null,null,null,null,null,null,null,null,null,null,null,null,null,null,"NE035","No"]
[null,null,null,null,"",null,null,null,null,null,null,null,null,null,null,null,null,null,null,null,null,"NE036","No"]
[null,null,null,null,"",null,null,null,null,null,null,null,null,null,null,null,null,null,null,null,null,"NE037","No"]
[null,null,null,null,"",null,null,null,null,null,null,null,null,null,null,null,null,null,null,null,null,"NE038","No"]
[null,null,null,null,"",null,null,null,null,null,null,null,null,null,null,null,null,null,null,null,null,"NE039","No"]
[null,null,null,null,"",null,null,null,null,null,null,null,null,null,null,null,null,null,null,null,null,"NE040","No"]
[null,null,null,null,"",null,null,null,null,null,null,null,null,null,null,null,null,null,null,null,null,"NE041","No"]
[null,null,null,null,"",null,null,null,null,null,null,null,null,null,null,null,null,null,null,null,null,"NE042","No"]
[null,null,null,null,"",null,null,null,null,null,null,null,null,null,null,null,null,null,null,null,null,"NE043","No"]
[null,null,null,null,"",null,null,null,null,null,null,null,null,null,null,null,null,null,null,null,null,"NE046","No"]
[null,null,null,null,"",null,null,null,null,null,null,null,null,null,null,null,null,null,null,null,null,"NE047","No"]
[null,null,null,null,"",null,null,null,null,null,null,null,null,null,null,null,null,null,null,null,null,"NE049","No"]
[null,null,null,null,"",null,null,null,null,null,null,null,null,null,null,null,null,null,null,null,null,"NE050","No"]
[null,null,null,null,"",null,null,null,null,null,null,null,null,null,null,null,null,null,null,null,null,"NE051","No"]
[null,null,null,null,"",null,null,null,null,null,null,null,null,null,null,null,null,null,null,null,null,"NE053","No"]
[null,null,null,null,"",null,null,null,null,null,null,null,null,null,null,null,null,null,null,null,null,"NE057","No"]
[null,null,null,null,"",null,null,null,null,null,null,null,null,null,null,null,null,null,null,null,null,"NE059","No"]
[null,null,null,null,"",null,null,null,null,null,null,null,null,null,null,null,null,null,null,null,null,"NE063","No"]
[null,null,null,null,"",null,null,null,null,null,null,null,null,null,null,null,null,null,null,null,null,"NE064","No"]
[null,null,null,null,"",null,null,null,null,null,null,null,null,null,null,null,null,null,null,null,null,"NE065","No"]
[null,null,null,null,"",null,null,null,null,null,null,null,null,null,null,null,null,null,null,null,null,"NE067","No"]
[null,null,null,null,"",null,null,null,null,null,null,null,null,null,null,null,null,null,null,null,null,"NE068","No"]
[null,null,null,null,"",null,null,null,null,null,null,null,null,null,null,null,null,null,null,null,null,"NE069","No"]
[null,null,null,null,"",null,null,null,null,null,null,null,null,null,null,null,null,null,null,null,null,"NE070","No"]
[null,null,null,null,"",null,null,null,null,null,null,null,null,null,null,null,null,null,null,null,null,"NE071","No"]
[null,null,null,null,"",null,null,null,null,null,null,null,null,null,null,null,null,null,null,null,null,"NE072","No"]
[null,null,null,null,"",null,null,null,null,null,null,null,null,null,null,null,null,null,null,null,null,"NE073","No"]
[null,null,null,null,"",null,null,null,null,null,null,null,null,null,null,null,null,null,null,null,null,"NE074","No"]
[null,null,null,null,"",null,null,null,null,null,null,null,null,null,null,null,null,null,null,null,null,"NE075","No"]
[null,null,null,null,"",null,null,null,null,null,null,null,null,null,null,null,null,null,null,null,null,"NE076","No"]
[null,null,null,null,"",null,null,null,null,null,null,null,null,null,null,null,null,null,null,null,null,"NE077","No"]
[null,null,null,null,"",null,null,null,null,null,null,null,null,null,null,null,null,null,null,null,null,"NE078","No"]
[null,null,null,null,"",null,null,null,null,null,null,null,null,null,null,null,null,null,null,null,null,"NE082","No"]
[null,null,null,null,"",null,null,null,null,null,null,null,null,null,null,null,null,null,null,null,null,"NE083","No"]
[null,null,null,null,"",null,null,null,null,null,null,null,null,null,null,null,null,null,null,null,null,"NE085","No"]
[null,null,null,null,"",null,null,null,null,null,null,null,null,null,null,null,null,null,null,null,null,"NE086","No"]
[null,null,null,null,"",null,null,null,null,null,null,null,null,null,null,null,null,null,null,null,null,"NE088","No"]
[null,null,null,null,"",null,null,null,null,null,null,null,null,null,null,null,null,null,null,null,null,"NE090","No"]
[null,null,null,null,"",null,null,null,null,null,null,null,null,null,null,null,null,null,null,null,null,"NE091","No"]
[null,null,null,null,"",null,null,null,null,null,null,null,null,null,null,null,null,null,null,null,null,"NE092","No"]
[null,null,null,null,"",null,null,null,null,null,null,null,null,null,null,null,null,null,null,null,null,"NE093","No"]
[null,null,null,null,"",null,null,null,null,null,null,null,null,null,null,null,null,null,null,null,null,"NE094","No"]
[null,null,null,null,"",null,null,null,null,null,null,null,null,null,null,null,null,null,null,null,null,"NE095","No"]
[null,null,null,null,"",null,null,null,null,null,null,null,null,null,null,null,null,null,null,null,null,"NE096","No"]
[null,null,null,null,"",null,null,null,null,null,null,null,null,null,null,null,null,null,null,null,null,"NE097","No"]
[null,null,null,null,"",null,null,null,null,null,null,null,null,null,null,null,null,null,null,null,null,"NE098","No"]
[null,null,null,null,"",null,null,null,null,null,null,null,null,null,null,null,null,null,null,null,null,"NE099","No"]
[null,null,null,null,"",null,null,null,null,null,null,null,null,null,null,null,null,null,null,null,null,"NE100","No"]
[null,null,null,null,"",null,null,null,null,null,null,null,null,null,null,null,null,null,null,null,null,"NE101","No"]
[null,null,null,null,"",null,null,null,null,null,null,null,null,null,null,null,null,null,null,null,null,"NE102","No"]
[null,null,null,null,"",null,null,null,null,null,null,null,null,null,null,null,null,null,null,null,null,"NE103","No"]
[null,null,null,null,"",null,null,null,null,null,null,null,null,null,null,null,null,null,null,null,null,"NE104","No"]
[null,null,null,null,"",null,null,null,null,null,null,null,null,null,null,null,null,null,null,null,null,"NE106","No"]
[null,null,null,null,"",null,null,null,null,null,null,null,null,null,null,null,null,null,null,null,null,"NE107","No"]
[null,null,null,null,"",null,null,null,null,null,null,null,null,null,null,null,null,null,null,null,null,"NE108","No"]
[null,null,null,null,"",null,null,null,null,null,null,null,null,null,null,null,null,null,null,null,null,"NE109","No"]
[null,null,null,null,"",null,null,null,null,null,null,null,null,null,null,null,null,null,null,null,null,"NE110","No"]
[null,null,null,null,"",null,null,null,null,null,null,null,null,null,null,null,null,null,null,null,null,"NE111","No"]
[null,null,null,null,"",null,null,null,null,null,null,null,null,null,null,null,null,null,null,null,null,"NE115","No"]
[null,null,null,null,"",null,null,null,null,null,null,null,null,null,null,null,null,null,null,null,null,"NE117","No"]
[null,null,null,null,"",null,null,null,null,null,null,null,null,null,null,null,null,null,null,null,null,"NE120","No"]
[null,null,null,null,"",null,null,null,null,null,null,null,null,null,null,null,null,null,null,null,null,"NE123","No"]
[null,null,null,null,{"$f":"LEFT(F1923,2)","v":""},null,null,null,null,null,null,null,null,null,null,null,null,null,null,null,null,"NE125","No"]
[null,null,null,null,"",null,null,null,null,null,null,null,null,null,null,null,null,null,null,null,null,"NE131","No"]
[null,null,null,null,"",null,null,null,null,null,null,null,null,null,null,null,null,null,null,null,null,"NE141","No"]
[null,null,null,null,"",null,null,null,null,null,null,null,null,null,null,null,null,null,null,null,null,"NE153","Yes"]
[null,null,null,null,"",null,null,null,null,null,null,null,null,null,null,null,null,null,null,null,null,"NE174","No"]
[null,null,null,null,"",null,null,null,null,null,null,null,null,null,null,null,null,null,null,null,null,"NH001","No"]
[null,null,null,null,"",null,null,null,null,null,null,null,null,null,null,null,null,null,null,null,null,"NH002","No"]
[null,null,null,null,"",null,null,null,null,null,null,null,null,null,null,null,null,null,null,null,null,"NH003","No"]
[null,null,null,null,"",null,null,null,null,null,null,null,null,null,null,null,null,null,null,null,null,"NH004","No"]
[null,null,null,null,"",null,null,null,null,null,null,null,null,null,null,null,null,null,null,null,null,"NH005","Yes"]
[null,null,null,null,"",null,null,null,null,null,null,null,null,null,null,null,null,null,null,null,null,"NH006","No"]
[null,null,null,null,"",null,null,null,null,null,null,null,null,null,null,null,null,null,null,null,null,"NH007","No"]
[null,null,null,null,"",null,null,null,null,null,null,null,null,null,null,null,null,null,null,null,null,"NH008","No"]
[null,null,null,null,"",null,null,null,null,null,null,null,null,null,null,null,null,null,null,null,null,"NH009","No"]
[null,null,null,null,"",null,null,null,null,null,null,null,null,null,null,null,null,null,null,null,null,"NH010","No"]
[null,null,null,null,"",null,null,null,null,null,null,null,null,null,null,null,null,null,null,null,null,"NH011","No"]
[null,null,null,null,"",null,null,null,null,null,null,null,null,null,null,null,null,null,null,null,null,"NH012","No"]
[null,null,null,null,"",null,null,null,null,null,null,null,null,null,null,null,null,null,null,null,null,"NH013","No"]
[null,null,null,null,"",null,null,null,null,null,null,null,null,null,null,null,null,null,null,null,null,"NH014","No"]
[null,null,null,null,"",null,null,null,null,null,null,null,null,null,null,null,null,null,null,null,null,"NH017","No"]
[null,null,null,null,"",null,null,null,null,null,null,null,null,null,null,null,null,null,null,null,null,"NJ002","No"]
[null,null,null,null,"",null,null,null,null,null,null,null,null,null,null,null,null,null,null,null,null,"NJ003","Yes"]
[null,null,null,null,"",null,null,null,null,null,null,null,null,null,null,null,null,null,null,null,null,"NJ004","Yes"]
[null,null,null,null,"",null,null,null,null,null,null,null,null,null,null,null,null,null,null,null,null,"NJ005","No"]
[null,null,null,null,"",null,null,null,null,null,null,null,null,null,null,null,null,null,null,null,null,"NJ006","No"]
[null,null,null,null,"",null,null,null,null,null,null,null,null,null,null,null,null,null,null,null,null,"NJ007","No"]
[null,null,null,null,"",null,null,null,null,null,null,null,null,null,null,null,null,null,null,null,null,"NJ008","No"]
[null,null,null,null,"",null,null,null,null,null,null,null,null,null,null,null,null,null,null,null,null,"NJ009","No"]
[null,null,null,null,"",null,null,null,null,null,null,null,null,null,null,null,null,null,null,null,null,"NJ010","No"]
[null,null,null,null,"",null,null,null,null,null,null,null,null,null,null,null,null,null,null,null,null,"NJ011","No"]
[null,null,null,null,"",null,null,null,null,null,null,null,null,null,null,null,null,null,null,null,null,"NJ012","Yes"]
[null,null,null,null,"",null,null,null,null,null,null,null,null,null,null,null,null,null,null,null,null,"NJ013","No"]
[null,null,null,null,"",null,null,null,null,null,null,null,null,null,null,null,null,null,null,null,null,"NJ014","No"]
[null,null,null,null,"",null,null,null,null,null,null,null,null,null,null,null,null,null,null,null,null,"NJ015","No"]
[null,null,null,null,"",null,null,null,null,null,null,null,null,null,null,null,null,null,null,null,null,"NJ016","No"]
[null,null,null,null,"",null,null,null,null,null,null,null,null,null,null,null,null,null,null,null,null,"NJ017","No"]
[null,null,null,null,"",null,null,null,null,null,null,null,null,null,null,null,null,null,null,null,null,"NJ018","No"]
[null,null,null,null,"",null,null,null,null,null,null,null,null,null,null,null,null,null,null,null,null,"NJ020","No"]
[null,null,null,null,"",null,null,null,null,null,null,null,null,null,null,null,null,null,null,null,null,"NJ021","No"]
[null,null,null,null,"",null,null,null,null,null,null,null,null,null,null,null,null,null,null,null,null,"NJ022","No"]
[null,null,null,null,"",null,null,null,null,null,null,null,null,null,null,null,null,null,null,null,null,"NJ023","No"]
[null,null,null,null,"",null,null,null,null,null,null,null,null,null,null,null,null,null,null,null,null,"NJ024","No"]
[null,null,null,null,"",null,null,null,null,null,null,null,null,null,null,null,null,null,null,null,null,"NJ025","No"]
[null,null,null,null,"",null,null,null,null,null,null,null,null,null,null,null,null,null,null,null,null,"NJ026","No"]
[null,null,null,null,"",null,null,null,null,null,null,null,null,null,null,null,null,null,null,null,null,"NJ027","No"]
[null,null,null,null,"",null,null,null,null,null,null,null,null,null,null,null,null,null,null,null,null,"NJ028","No"]
[null,null,null,null,"",null,null,null,null,null,null,null,null,null,null,null,null,null,null,null,null,"NJ030","No"]
[null,null,null,null,"",null,null,null,null,null,null,null,null,null,null,null,null,null,null,null,null,"NJ032","No"]
[null,null,null,null,"",null,null,null,null,null,null,null,null,null,null,null,null,null,null,null,null,"NJ033","No"]
[null,null,null,null,"",null,null,null,null,null,null,null,null,null,null,null,null,null,null,null,null,"NJ034","No"]
[null,null,null,null,"",null,null,null,null,null,null,null,null,null,null,null,null,null,null,null,null,"NJ035","No"]
[null,null,null,null,"",null,null,null,null,null,null,null,null,null,null,null,null,null,null,null,null,"NJ036","No"]
[null,null,null,null,"",null,null,null,null,null,null,null,null,null,null,null,null,null,null,null,null,"NJ037","No"]
[null,null,null,null,"",null,null,null,null,null,null,null,null,null,null,null,null,null,null,null,null,"NJ038","No"]
[null,null,null,null,"",null,null,null,null,null,null,null,null,null,null,null,null,null,null,null,null,"NJ039","No"]
[null,null,null,null,"",null,null,null,null,null,null,null,null,null,null,null,null,null,null,null,null,"NJ041","No"]
[null,null,null,null,"",null,null,null,null,null,null,null,null,null,null,null,null,null,null,null,null,"NJ042","No"]
[null,null,null,null,"",null,null,null,null,null,null,null,null,null,null,null,null,null,null,null,null,"NJ043","No"]
[null,null,null,null,"",null,null,null,null,null,null,null,null,null,null,null,null,null,null,null,null,"NJ044","No"]
[null,null,null,null,"",null,null,null,null,null,null,null,null,null,null,null,null,null,null,null,null,"NJ045","No"]
[null,null,null,null,"",null,null,null,null,null,null,null,null,null,null,null,null,null,null,null,null,"NJ046","No"]
[null,null,null,null,"",null,null,null,null,null,null,null,null,null,null,null,null,null,null,null,null,"NJ047","No"]
[null,null,null,null,"",null,null,null,null,null,null,null,null,null,null,null,null,null,null,null,null,"NJ048","No"]
[null,null,null,null,"",null,null,null,null,null,null,null,null,null,null,null,null,null,null,null,null,"NJ049","No"]
[null,null,null,null,{"$f":"LEFT(F1987,2)","v":""},null,null,null,null,null,null,null,null,null,null,null,null,null,null,null,null,"NJ050","No"]
[null,null,null,null,"",null,null,null,null,null,null,null,null,null,null,null,null,null,null,null,null,"NJ051","No"]
[null,null,null,null,"",null,null,null,null,null,null,null,null,null,null,null,null,null,null,null,null,"NJ052","No"]
[null,null,null,null,"",null,null,null,null,null,null,null,null,null,null,null,null,null,null,null,null,"NJ053","No"]
[null,null,null,null,"",null,null,null,null,null,null,null,null,null,null,null,null,null,null,null,null,"NJ054","No"]
[null,null,null,null,"",null,null,null,null,null,null,null,null,null,null,null,null,null,null,null,null,"NJ055","No"]
[null,null,null,null,"",null,null,null,null,null,null,null,null,null,null,null,null,null,null,null,null,"NJ056","No"]
[null,null,null,null,"",null,null,null,null,null,null,null,null,null,null,null,null,null,null,null,null,"NJ057","No"]
[null,null,null,null,"",null,null,null,null,null,null,null,null,null,null,null,null,null,null,null,null,"NJ058","No"]
[null,null,null,null,"",null,null,null,null,null,null,null,null,null,null,null,null,null,null,null,null,"NJ059","Yes"]
[null,null,null,null,"",null,null,null,null,null,null,null,null,null,null,null,null,null,null,null,null,"NJ060","No"]
[null,null,null,null,"",null,null,null,null,null,null,null,null,null,null,null,null,null,null,null,null,"NJ061","No"]
[null,null,null,null,"",null,null,null,null,null,null,null,null,null,null,null,null,null,null,null,null,"NJ062","No"]
[null,null,null,null,"",null,null,null,null,null,null,null,null,null,null,null,null,null,null,null,null,"NJ063","No"]
[null,null,null,null,"",null,null,null,null,null,null,null,null,null,null,null,null,null,null,null,null,"NJ064","No"]
[null,null,null,null,"",null,null,null,null,null,null,null,null,null,null,null,null,null,null,null,null,"NJ065","No"]
[null,null,null,null,"",null,null,null,null,null,null,null,null,null,null,null,null,null,null,null,null,"NJ066","No"]
[null,null,null,null,"",null,null,null,null,null,null,null,null,null,null,null,null,null,null,null,null,"NJ067","No"]
[null,null,null,null,"",null,null,null,null,null,null,null,null,null,null,null,null,null,null,null,null,"NJ068","No"]
[null,null,null,null,"",null,null,null,null,null,null,null,null,null,null,null,null,null,null,null,null,"NJ069","No"]
[null,null,null,null,"",null,null,null,null,null,null,null,null,null,null,null,null,null,null,null,null,"NJ070","No"]
[null,null,null,null,"",null,null,null,null,null,null,null,null,null,null,null,null,null,null,null,null,"NJ071","No"]
[null,null,null,null,"",null,null,null,null,null,null,null,null,null,null,null,null,null,null,null,null,"NJ073","No"]
[null,null,null,null,"",null,null,null,null,null,null,null,null,null,null,null,null,null,null,null,null,"NJ074","No"]
[null,null,null,null,"",null,null,null,null,null,null,null,null,null,null,null,null,null,null,null,null,"NJ075","No"]
[null,null,null,null,"",null,null,null,null,null,null,null,null,null,null,null,null,null,null,null,null,"NJ076","No"]
[null,null,null,null,"",null,null,null,null,null,null,null,null,null,null,null,null,null,null,null,null,"NJ077","No"]
[null,null,null,null,"",null,null,null,null,null,null,null,null,null,null,null,null,null,null,null,null,"NJ079","No"]
[null,null,null,null,"",null,null,null,null,null,null,null,null,null,null,null,null,null,null,null,null,"NJ080","Yes"]
[null,null,null,null,"",null,null,null,null,null,null,null,null,null,null,null,null,null,null,null,null,"NJ081","Yes"]
[null,null,null,null,"",null,null,null,null,null,null,null,null,null,null,null,null,null,null,null,null,"NJ083","No"]
[null,null,null,null,"",null,null,null,null,null,null,null,null,null,null,null,null,null,null,null,null,"NJ092","No"]
[null,null,null,null,"",null,null,null,null,null,null,null,null,null,null,null,null,null,null,null,null,"NJ105","No"]
[null,null,null,null,"",null,null,null,null,null,null,null,null,null,null,null,null,null,null,null,null,"NJ202","No"]
[null,null,null,null,"",null,null,null,null,null,null,null,null,null,null,null,null,null,null,null,null,"NJ204","No"]
[null,null,null,null,"",null,null,null,null,null,null,null,null,null,null,null,null,null,null,null,null,"NJ218","No"]
[null,null,null,null,"",null,null,null,null,null,null,null,null,null,null,null,null,null,null,null,null,"NM001","No"]
[null,null,null,null,"",null,null,null,null,null,null,null,null,null,null,null,null,null,null,null,null,"NM002","No"]
[null,null,null,null,"",null,null,null,null,null,null,null,null,null,null,null,null,null,null,null,null,"NM003","No"]
[null,null,null,null,"",null,null,null,null,null,null,null,null,null,null,null,null,null,null,null,null,"NM004","No"]
[null,null,null,null,"",null,null,null,null,null,null,null,null,null,null,null,null,null,null,null,null,"NM006","No"]
[null,null,null,null,"",null,null,null,null,null,null,null,null,null,null,null,null,null,null,null,null,"NM007","Yes"]
[null,null,null,null,"",null,null,null,null,null,null,null,null,null,null,null,null,null,null,null,null,"NM008","No"]
[null,null,null,null,"",null,null,null,null,null,null,null,null,null,null,null,null,null,null,null,null,"NM009","No"]
[null,null,null,null,"",null,null,null,null,null,null,null,null,null,null,null,null,null,null,null,null,"NM010","No"]
[null,null,null,null,"",null,null,null,null,null,null,null,null,null,null,null,null,null,null,null,null,"NM020","No"]
[null,null,null,null,"",null,null,null,null,null,null,null,null,null,null,null,null,null,null,null,null,"NM021","No"]
[null,null,null,null,"",null,null,null,null,null,null,null,null,null,null,null,null,null,null,null,null,"NM022","No"]
[null,null,null,null,"",null,null,null,null,null,null,null,null,null,null,null,null,null,null,null,null,"NM023","No"]
[null,null,null,null,"",null,null,null,null,null,null,null,null,null,null,null,null,null,null,null,null,"NM024","No"]
[null,null,null,null,"",null,null,null,null,null,null,null,null,null,null,null,null,null,null,null,null,"NM025","No"]
[null,null,null,null,"",null,null,null,null,null,null,null,null,null,null,null,null,null,null,null,null,"NM026","No"]
[null,null,null,null,"",null,null,null,null,null,null,null,null,null,null,null,null,null,null,null,null,"NM027","No"]
[null,null,null,null,"",null,null,null,null,null,null,null,null,null,null,null,null,null,null,null,null,"NM029","No"]
[null,null,null,null,"",null,null,null,null,null,null,null,null,null,null,null,null,null,null,null,null,"NM030","No"]
[null,null,null,null,"",null,null,null,null,null,null,null,null,null,null,null,null,null,null,null,null,"NM032","No"]
[null,null,null,null,"",null,null,null,null,null,null,null,null,null,null,null,null,null,null,null,null,"NM033","No"]
[null,null,null,null,"",null,null,null,null,null,null,null,null,null,null,null,null,null,null,null,null,"NM034","No"]
[null,null,null,null,"",null,null,null,null,null,null,null,null,null,null,null,null,null,null,null,null,"NM035","No"]
[null,null,null,null,"",null,null,null,null,null,null,null,null,null,null,null,null,null,null,null,null,"NM038","No"]
[null,null,null,null,"",null,null,null,null,null,null,null,null,null,null,null,null,null,null,null,null,"NM039","No"]
[null,null,null,null,"",null,null,null,null,null,null,null,null,null,null,null,null,null,null,null,null,"NM045","No"]
[null,null,null,null,"",null,null,null,null,null,null,null,null,null,null,null,null,null,null,null,null,"NM047","No"]
[null,null,null,null,"",null,null,null,null,null,null,null,null,null,null,null,null,null,null,null,null,"NM048","No"]
[null,null,null,null,{"$f":"LEFT(F2051,2)","v":""},null,null,null,null,null,null,null,null,null,null,null,null,null,null,null,null,"NM050","No"]
[null,null,null,null,"",null,null,null,null,null,null,null,null,null,null,null,null,null,null,null,null,"NM054","No"]
[null,null,null,null,"",null,null,null,null,null,null,null,null,null,null,null,null,null,null,null,null,"NM055","No"]
[null,null,null,null,"",null,null,null,null,null,null,null,null,null,null,null,null,null,null,null,null,"NM057","No"]
[null,null,null,null,"",null,null,null,null,null,null,null,null,null,null,null,null,null,null,null,null,"NM062","No"]
[null,null,null,null,"",null,null,null,null,null,null,null,null,null,null,null,null,null,null,null,null,"NM063","No"]
[null,null,null,null,"",null,null,null,null,null,null,null,null,null,null,null,null,null,null,null,null,"NM067","No"]
[null,null,null,null,"",null,null,null,null,null,null,null,null,null,null,null,null,null,null,null,null,"NM071","No"]
[null,null,null,null,"",null,null,null,null,null,null,null,null,null,null,null,null,null,null,null,null,"NM075","Yes"]
[null,null,null,null,"",null,null,null,null,null,null,null,null,null,null,null,null,null,null,null,null,"NV001","No"]
[null,null,null,null,"",null,null,null,null,null,null,null,null,null,null,null,null,null,null,null,null,"NV002","Yes"]
[null,null,null,null,"",null,null,null,null,null,null,null,null,null,null,null,null,null,null,null,null,"NV007","Yes"]
[null,null,null,null,"",null,null,null,null,null,null,null,null,null,null,null,null,null,null,null,null,"NV013","Yes"]
[null,null,null,null,"",null,null,null,null,null,null,null,null,null,null,null,null,null,null,null,null,"NY001","No"]
[null,null,null,null,"",null,null,null,null,null,null,null,null,null,null,null,null,null,null,null,null,"NY002","Yes"]
[null,null,null,null,"",null,null,null,null,null,null,null,null,null,null,null,null,null,null,null,null,"NY003","No"]
[null,null,null,null,"",null,null,null,null,null,null,null,null,null,null,null,null,null,null,null,null,"NY005","No"]
[null,null,null,null,"",null,null,null,null,null,null,null,null,null,null,null,null,null,null,null,null,"NY006","Yes"]
[null,null,null,null,"",null,null,null,null,null,null,null,null,null,null,null,null,null,null,null,null,"NY008","No"]
[null,null,null,null,"",null,null,null,null,null,null,null,null,null,null,null,null,null,null,null,null,"NY009","Yes"]
[null,null,null,null,"",null,null,null,null,null,null,null,null,null,null,null,null,null,null,null,null,"NY010","No"]
[null,null,null,null,"",null,null,null,null,null,null,null,null,null,null,null,null,null,null,null,null,"NY011","No"]
[null,null,null,null,"",null,null,null,null,null,null,null,null,null,null,null,null,null,null,null,null,"NY012","No"]
[null,null,null,null,"",null,null,null,null,null,null,null,null,null,null,null,null,null,null,null,null,"NY013","No"]
[null,null,null,null,"",null,null,null,null,null,null,null,null,null,null,null,null,null,null,null,null,"NY014","Yes"]
[null,null,null,null,"",null,null,null,null,null,null,null,null,null,null,null,null,null,null,null,null,"NY015","Yes"]
[null,null,null,null,"",null,null,null,null,null,null,null,null,null,null,null,null,null,null,null,null,"NY016","Yes"]
[null,null,null,null,"",null,null,null,null,null,null,null,null,null,null,null,null,null,null,null,null,"NY017","No"]
[null,null,null,null,"",null,null,null,null,null,null,null,null,null,null,null,null,null,null,null,null,"NY018","No"]
[null,null,null,null,"",null,null,null,null,null,null,null,null,null,null,null,null,null,null,null,null,"NY019","No"]
[null,null,null,null,"",null,null,null,null,null,null,null,null,null,null,null,null,null,null,null,null,"NY020","No"]
[null,null,null,null,"",null,null,null,null,null,null,null,null,null,null,null,null,null,null,null,null,"NY021","No"]
[null,null,null,null,"",null,null,null,null,null,null,null,null,null,null,null,null,null,null,null,null,"NY022","No"]
[null,null,null,null,"",null,null,null,null,null,null,null,null,null,null,null,null,null,null,null,null,"NY023","No"]
[null,null,null,null,"",null,null,null,null,null,null,null,null,null,null,null,null,null,null,null,null,"NY025","Yes"]
[null,null,null,null,"",null,null,null,null,null,null,null,null,null,null,null,null,null,null,null,null,"NY026","No"]
[null,null,null,null,"",null,null,null,null,null,null,null,null,null,null,null,null,null,null,null,null,"NY028","Yes"]
[null,null,null,null,"",null,null,null,null,null,null,null,null,null,null,null,null,null,null,null,null,"NY029","No"]
[null,null,null,null,"",null,null,null,null,null,null,null,null,null,null,null,null,null,null,null,null,"NY030","No"]
[null,null,null,null,"",null,null,null,null,null,null,null,null,null,null,null,null,null,null,null,null,"NY031","No"]
[null,null,null,null,"",null,null,null,null,null,null,null,null,null,null,null,null,null,null,null,null,"NY032","No"]
[null,null,null,null,"",null,null,null,null,null,null,null,null,null,null,null,null,null,null,null,null,"NY033","No"]
[null,null,null,null,"",null,null,null,null,null,null,null,null,null,null,null,null,null,null,null,null,"NY034","No"]
[null,null,null,null,"",null,null,null,null,null,null,null,null,null,null,null,null,null,null,null,null,"NY035","No"]
[null,null,null,null,"",null,null,null,null,null,null,null,null,null,null,null,null,null,null,null,null,"NY038","Yes"]
[null,null,null,null,"",null,null,null,null,null,null,null,null,null,null,null,null,null,null,null,null,"NY039","No"]
[null,null,null,null,"",null,null,null,null,null,null,null,null,null,null,null,null,null,null,null,null,"NY041","No"]
[null,null,null,null,"",null,null,null,null,null,null,null,null,null,null,null,null,null,null,null,null,"NY042","No"]
[null,null,null,null,"",null,null,null,null,null,null,null,null,null,null,null,null,null,null,null,null,"NY044","No"]
[null,null,null,null,"",null,null,null,null,null,null,null,null,null,null,null,null,null,null,null,null,"NY045","No"]
[null,null,null,null,"",null,null,null,null,null,null,null,null,null,null,null,null,null,null,null,null,"NY046","No"]
[null,null,null,null,"",null,null,null,null,null,null,null,null,null,null,null,null,null,null,null,null,"NY048","No"]
[null,null,null,null,"",null,null,null,null,null,null,null,null,null,null,null,null,null,null,null,null,"NY049","No"]
[null,null,null,null,"",null,null,null,null,null,null,null,null,null,null,null,null,null,null,null,null,"NY050","No"]
[null,null,null,null,"",null,null,null,null,null,null,null,null,null,null,null,null,null,null,null,null,"NY051","No"]
[null,null,null,null,"",null,null,null,null,null,null,null,null,null,null,null,null,null,null,null,null,"NY052","No"]
[null,null,null,null,"",null,null,null,null,null,null,null,null,null,null,null,null,null,null,null,null,"NY054","No"]
[null,null,null,null,"",null,null,null,null,null,null,null,null,null,null,null,null,null,null,null,null,"NY055","No"]
[null,null,null,null,"",null,null,null,null,null,null,null,null,null,null,null,null,null,null,null,null,"NY056","No"]
[null,null,null,null,"",null,null,null,null,null,null,null,null,null,null,null,null,null,null,null,null,"NY057","No"]
[null,null,null,null,"",null,null,null,null,null,null,null,null,null,null,null,null,null,null,null,null,"NY058","No"]
[null,null,null,null,"",null,null,null,null,null,null,null,null,null,null,null,null,null,null,null,null,"NY059","No"]
[null,null,null,null,"",null,null,null,null,null,null,null,null,null,null,null,null,null,null,null,null,"NY060","No"]
[null,null,null,null,"",null,null,null,null,null,null,null,null,null,null,null,null,null,null,null,null,"NY061","Yes"]
[null,null,null,null,{"$f":"LEFT(F2115,2)","v":""},null,null,null,null,null,null,null,null,null,null,null,null,null,null,null,null,"NY062","No"]
[null,null,null,null,"",null,null,null,null,null,null,null,null,null,null,null,null,null,null,null,null,"NY063","No"]
[null,null,null,null,"",null,null,null,null,null,null,null,null,null,null,null,null,null,null,null,null,"NY064","No"]
[null,null,null,null,"",null,null,null,null,null,null,null,null,null,null,null,null,null,null,null,null,"NY065","No"]
[null,null,null,null,"",null,null,null,null,null,null,null,null,null,null,null,null,null,null,null,null,"NY066","No"]
[null,null,null,null,"",null,null,null,null,null,null,null,null,null,null,null,null,null,null,null,null,"NY067","No"]
[null,null,null,null,"",null,null,null,null,null,null,null,null,null,null,null,null,null,null,null,null,"NY068","No"]
[null,null,null,null,"",null,null,null,null,null,null,null,null,null,null,null,null,null,null,null,null,"NY069","No"]
[null,null,null,null,"",null,null,null,null,null,null,null,null,null,null,null,null,null,null,null,null,"NY070","No"]
[null,null,null,null,"",null,null,null,null,null,null,null,null,null,null,null,null,null,null,null,null,"NY071","No"]
[null,null,null,null,"",null,null,null,null,null,null,null,null,null,null,null,null,null,null,null,null,"NY077","No"]
[null,null,null,null,"",null,null,null,null,null,null,null,null,null,null,null,null,null,null,null,null,"NY079","No"]
[null,null,null,null,"",null,null,null,null,null,null,null,null,null,null,null,null,null,null,null,null,"NY080","No"]
[null,null,null,null,"",null,null,null,null,null,null,null,null,null,null,null,null,null,null,null,null,"NY081","No"]
[null,null,null,null,"",null,null,null,null,null,null,null,null,null,null,null,null,null,null,null,null,"NY082","Yes"]
[null,null,null,null,"",null,null,null,null,null,null,null,null,null,null,null,null,null,null,null,null,"NY084","No"]
[null,null,null,null,"",null,null,null,null,null,null,null,null,null,null,null,null,null,null,null,null,"NY085","No"]
[null,null,null,null,"",null,null,null,null,null,null,null,null,null,null,null,null,null,null,null,null,"NY086","No"]
[null,null,null,null,"",null,null,null,null,null,null,null,null,null,null,null,null,null,null,null,null,"NY087","No"]
[null,null,null,null,"",null,null,null,null,null,null,null,null,null,null,null,null,null,null,null,null,"NY088","No"]
[null,null,null,null,"",null,null,null,null,null,null,null,null,null,null,null,null,null,null,null,null,"NY089","No"]
[null,null,null,null,"",null,null,null,null,null,null,null,null,null,null,null,null,null,null,null,null,"NY093","No"]
[null,null,null,null,"",null,null,null,null,null,null,null,null,null,null,null,null,null,null,null,null,"NY097","No"]
[null,null,null,null,"",null,null,null,null,null,null,null,null,null,null,null,null,null,null,null,null,"NY098","No"]
[null,null,null,null,"",null,null,null,null,null,null,null,null,null,null,null,null,null,null,null,null,"NY099","No"]
[null,null,null,null,"",null,null,null,null,null,null,null,null,null,null,null,null,null,null,null,null,"NY100","No"]
[null,null,null,null,"",null,null,null,null,null,null,null,null,null,null,null,null,null,null,null,null,"NY102","No"]
[null,null,null,null,"",null,null,null,null,null,null,null,null,null,null,null,null,null,null,null,null,"NY103","No"]
[null,null,null,null,"",null,null,null,null,null,null,null,null,null,null,null,null,null,null,null,null,"NY144","No"]
[null,null,null,null,"",null,null,null,null,null,null,null,null,null,null,null,null,null,null,null,null,"NY158","No"]
[null,null,null,null,"",null,null,null,null,null,null,null,null,null,null,null,null,null,null,null,null,"NY400","No"]
[null,null,null,null,"",null,null,null,null,null,null,null,null,null,null,null,null,null,null,null,null,"NY414","No"]
[null,null,null,null,"",null,null,null,null,null,null,null,null,null,null,null,null,null,null,null,null,"NY501","Yes"]
[null,null,null,null,"",null,null,null,null,null,null,null,null,null,null,null,null,null,null,null,null,"OH001","Yes"]
[null,null,null,null,"",null,null,null,null,null,null,null,null,null,null,null,null,null,null,null,null,"OH002","Yes"]
[null,null,null,null,"",null,null,null,null,null,null,null,null,null,null,null,null,null,null,null,null,"OH003","No"]
[null,null,null,null,"",null,null,null,null,null,null,null,null,null,null,null,null,null,null,null,null,"OH004","Yes"]
[null,null,null,null,"",null,null,null,null,null,null,null,null,null,null,null,null,null,null,null,null,"OH005","Yes"]
[null,null,null,null,"",null,null,null,null,null,null,null,null,null,null,null,null,null,null,null,null,"OH006","No"]
[null,null,null,null,"",null,null,null,null,null,null,null,null,null,null,null,null,null,null,null,null,"OH007","Yes"]
[null,null,null,null,"",null,null,null,null,null,null,null,null,null,null,null,null,null,null,null,null,"OH008","No"]
[null,null,null,null,"",null,null,null,null,null,null,null,null,null,null,null,null,null,null,null,null,"OH009","No"]
[null,null,null,null,"",null,null,null,null,null,null,null,null,null,null,null,null,null,null,null,null,"OH010","Yes"]
[null,null,null,null,"",null,null,null,null,null,null,null,null,null,null,null,null,null,null,null,null,"OH012","No"]
[null,null,null,null,"",null,null,null,null,null,null,null,null,null,null,null,null,null,null,null,null,"OH014","No"]
[null,null,null,null,"",null,null,null,null,null,null,null,null,null,null,null,null,null,null,null,null,"OH015","No"]
[null,null,null,null,"",null,null,null,null,null,null,null,null,null,null,null,null,null,null,null,null,"OH018","No"]
[null,null,null,null,"",null,null,null,null,null,null,null,null,null,null,null,null,null,null,null,null,"OH019","No"]
[null,null,null,null,"",null,null,null,null,null,null,null,null,null,null,null,null,null,null,null,null,"OH020","No"]
[null,null,null,null,"",null,null,null,null,null,null,null,null,null,null,null,null,null,null,null,null,"OH021","No"]
[null,null,null,null,"",null,null,null,null,null,null,null,null,null,null,null,null,null,null,null,null,"OH022","No"]
[null,null,null,null,"",null,null,null,null,null,null,null,null,null,null,null,null,null,null,null,null,"OH023","No"]
[null,null,null,null,"",null,null,null,null,null,null,null,null,null,null,null,null,null,null,null,null,"OH024","No"]
[null,null,null,null,"",null,null,null,null,null,null,null,null,null,null,null,null,null,null,null,null,"OH025","No"]
[null,null,null,null,"",null,null,null,null,null,null,null,null,null,null,null,null,null,null,null,null,"OH026","No"]
[null,null,null,null,"",null,null,null,null,null,null,null,null,null,null,null,null,null,null,null,null,"OH027","Yes"]
[null,null,null,null,"",null,null,null,null,null,null,null,null,null,null,null,null,null,null,null,null,"OH028","No"]
[null,null,null,null,"",null,null,null,null,null,null,null,null,null,null,null,null,null,null,null,null,"OH029","No"]
[null,null,null,null,"",null,null,null,null,null,null,null,null,null,null,null,null,null,null,null,null,"OH031","No"]
[null,null,null,null,"",null,null,null,null,null,null,null,null,null,null,null,null,null,null,null,null,"OH032","No"]
[null,null,null,null,"",null,null,null,null,null,null,null,null,null,null,null,null,null,null,null,null,"OH033","No"]
[null,null,null,null,"",null,null,null,null,null,null,null,null,null,null,null,null,null,null,null,null,"OH034","No"]
[null,null,null,null,"",null,null,null,null,null,null,null,null,null,null,null,null,null,null,null,null,"OH036","No"]
[null,null,null,null,"",null,null,null,null,null,null,null,null,null,null,null,null,null,null,null,null,"OH037","No"]
[null,null,null,null,{"$f":"LEFT(F2179,2)","v":""},null,null,null,null,null,null,null,null,null,null,null,null,null,null,null,null,"OH038","No"]
[null,null,null,null,"",null,null,null,null,null,null,null,null,null,null,null,null,null,null,null,null,"OH040","No"]
[null,null,null,null,"",null,null,null,null,null,null,null,null,null,null,null,null,null,null,null,null,"OH041","No"]
[null,null,null,null,"",null,null,null,null,null,null,null,null,null,null,null,null,null,null,null,null,"OH042","No"]
[null,null,null,null,"",null,null,null,null,null,null,null,null,null,null,null,null,null,null,null,null,"OH043","No"]
[null,null,null,null,"",null,null,null,null,null,null,null,null,null,null,null,null,null,null,null,null,"OH044","No"]
[null,null,null,null,"",null,null,null,null,null,null,null,null,null,null,null,null,null,null,null,null,"OH046","No"]
[null,null,null,null,"",null,null,null,null,null,null,null,null,null,null,null,null,null,null,null,null,"OH047","No"]
[null,null,null,null,"",null,null,null,null,null,null,null,null,null,null,null,null,null,null,null,null,"OH049","No"]
[null,null,null,null,"",null,null,null,null,null,null,null,null,null,null,null,null,null,null,null,null,"OH054","No"]
[null,null,null,null,"",null,null,null,null,null,null,null,null,null,null,null,null,null,null,null,null,"OH059","No"]
[null,null,null,null,"",null,null,null,null,null,null,null,null,null,null,null,null,null,null,null,null,"OH060","No"]
[null,null,null,null,"",null,null,null,null,null,null,null,null,null,null,null,null,null,null,null,null,"OH061","No"]
[null,null,null,null,"",null,null,null,null,null,null,null,null,null,null,null,null,null,null,null,null,"OH062","No"]
[null,null,null,null,"",null,null,null,null,null,null,null,null,null,null,null,null,null,null,null,null,"OH066","No"]
[null,null,null,null,"",null,null,null,null,null,null,null,null,null,null,null,null,null,null,null,null,"OH067","No"]
[null,null,null,null,"",null,null,null,null,null,null,null,null,null,null,null,null,null,null,null,null,"OH069","No"]
[null,null,null,null,"",null,null,null,null,null,null,null,null,null,null,null,null,null,null,null,null,"OH070","No"]
[null,null,null,null,"",null,null,null,null,null,null,null,null,null,null,null,null,null,null,null,null,"OH072","No"]
[null,null,null,null,"",null,null,null,null,null,null,null,null,null,null,null,null,null,null,null,null,"OH073","Yes"]
[null,null,null,null,"",null,null,null,null,null,null,null,null,null,null,null,null,null,null,null,null,"OH081","No"]
[null,null,null,null,"",null,null,null,null,null,null,null,null,null,null,null,null,null,null,null,null,"OK002","No"]
[null,null,null,null,"",null,null,null,null,null,null,null,null,null,null,null,null,null,null,null,null,"OK003","No"]
[null,null,null,null,"",null,null,null,null,null,null,null,null,null,null,null,null,null,null,null,null,"OK004","No"]
[null,null,null,null,"",null,null,null,null,null,null,null,null,null,null,null,null,null,null,null,null,"OK005","No"]
[null,null,null,null,"",null,null,null,null,null,null,null,null,null,null,null,null,null,null,null,null,"OK006","No"]
[null,null,null,null,"",null,null,null,null,null,null,null,null,null,null,null,null,null,null,null,null,"OK007","No"]
[null,null,null,null,"",null,null,null,null,null,null,null,null,null,null,null,null,null,null,null,null,"OK008","No"]
[null,null,null,null,"",null,null,null,null,null,null,null,null,null,null,null,null,null,null,null,null,"OK010","No"]
[null,null,null,null,"",null,null,null,null,null,null,null,null,null,null,null,null,null,null,null,null,"OK011","No"]
[null,null,null,null,"",null,null,null,null,null,null,null,null,null,null,null,null,null,null,null,null,"OK012","No"]
[null,null,null,null,"",null,null,null,null,null,null,null,null,null,null,null,null,null,null,null,null,"OK013","No"]
[null,null,null,null,"",null,null,null,null,null,null,null,null,null,null,null,null,null,null,null,null,"OK015","No"]
[null,null,null,null,"",null,null,null,null,null,null,null,null,null,null,null,null,null,null,null,null,"OK016","No"]
[null,null,null,null,"",null,null,null,null,null,null,null,null,null,null,null,null,null,null,null,null,"OK017","No"]
[null,null,null,null,"",null,null,null,null,null,null,null,null,null,null,null,null,null,null,null,null,"OK018","No"]
[null,null,null,null,"",null,null,null,null,null,null,null,null,null,null,null,null,null,null,null,null,"OK020","No"]
[null,null,null,null,"",null,null,null,null,null,null,null,null,null,null,null,null,null,null,null,null,"OK021","No"]
[null,null,null,null,"",null,null,null,null,null,null,null,null,null,null,null,null,null,null,null,null,"OK022","No"]
[null,null,null,null,"",null,null,null,null,null,null,null,null,null,null,null,null,null,null,null,null,"OK023","No"]
[null,null,null,null,"",null,null,null,null,null,null,null,null,null,null,null,null,null,null,null,null,"OK024","No"]
[null,null,null,null,"",null,null,null,null,null,null,null,null,null,null,null,null,null,null,null,null,"OK025","Yes"]
[null,null,null,null,"",null,null,null,null,null,null,null,null,null,null,null,null,null,null,null,null,"OK026","No"]
[null,null,null,null,"",null,null,null,null,null,null,null,null,null,null,null,null,null,null,null,null,"OK027","No"]
[null,null,null,null,"",null,null,null,null,null,null,null,null,null,null,null,null,null,null,null,null,"OK028","No"]
[null,null,null,null,"",null,null,null,null,null,null,null,null,null,null,null,null,null,null,null,null,"OK029","No"]
[null,null,null,null,"",null,null,null,null,null,null,null,null,null,null,null,null,null,null,null,null,"OK030","No"]
[null,null,null,null,"",null,null,null,null,null,null,null,null,null,null,null,null,null,null,null,null,"OK031","No"]
[null,null,null,null,"",null,null,null,null,null,null,null,null,null,null,null,null,null,null,null,null,"OK032","No"]
[null,null,null,null,"",null,null,null,null,null,null,null,null,null,null,null,null,null,null,null,null,"OK033","No"]
[null,null,null,null,"",null,null,null,null,null,null,null,null,null,null,null,null,null,null,null,null,"OK034","No"]
[null,null,null,null,"",null,null,null,null,null,null,null,null,null,null,null,null,null,null,null,null,"OK035","No"]
[null,null,null,null,"",null,null,null,null,null,null,null,null,null,null,null,null,null,null,null,null,"OK036","No"]
[null,null,null,null,"",null,null,null,null,null,null,null,null,null,null,null,null,null,null,null,null,"OK037","No"]
[null,null,null,null,"",null,null,null,null,null,null,null,null,null,null,null,null,null,null,null,null,"OK039","No"]
[null,null,null,null,"",null,null,null,null,null,null,null,null,null,null,null,null,null,null,null,null,"OK040","No"]
[null,null,null,null,"",null,null,null,null,null,null,null,null,null,null,null,null,null,null,null,null,"OK041","No"]
[null,null,null,null,"",null,null,null,null,null,null,null,null,null,null,null,null,null,null,null,null,"OK042","No"]
[null,null,null,null,"",null,null,null,null,null,null,null,null,null,null,null,null,null,null,null,null,"OK044","No"]
[null,null,null,null,"",null,null,null,null,null,null,null,null,null,null,null,null,null,null,null,null,"OK046","No"]
[null,null,null,null,"",null,null,null,null,null,null,null,null,null,null,null,null,null,null,null,null,"OK048","No"]
[null,null,null,null,"",null,null,null,null,null,null,null,null,null,null,null,null,null,null,null,null,"OK050","No"]
[null,null,null,null,"",null,null,null,null,null,null,null,null,null,null,null,null,null,null,null,null,"OK052","No"]
[null,null,null,null,"",null,null,null,null,null,null,null,null,null,null,null,null,null,null,null,null,"OK053","No"]
[null,null,null,null,{"$f":"LEFT(F2243,2)","v":""},null,null,null,null,null,null,null,null,null,null,null,null,null,null,null,null,"OK055","No"]
[null,null,null,null,"",null,null,null,null,null,null,null,null,null,null,null,null,null,null,null,null,"OK056","No"]
[null,null,null,null,"",null,null,null,null,null,null,null,null,null,null,null,null,null,null,null,null,"OK057","No"]
[null,null,null,null,"",null,null,null,null,null,null,null,null,null,null,null,null,null,null,null,null,"OK060","No"]
[null,null,null,null,"",null,null,null,null,null,null,null,null,null,null,null,null,null,null,null,null,"OK061","No"]
[null,null,null,null,"",null,null,null,null,null,null,null,null,null,null,null,null,null,null,null,null,"OK062","No"]
[null,null,null,null,"",null,null,null,null,null,null,null,null,null,null,null,null,null,null,null,null,"OK063","No"]
[null,null,null,null,"",null,null,null,null,null,null,null,null,null,null,null,null,null,null,null,null,"OK064","No"]
[null,null,null,null,"",null,null,null,null,null,null,null,null,null,null,null,null,null,null,null,null,"OK065","No"]
[null,null,null,null,"",null,null,null,null,null,null,null,null,null,null,null,null,null,null,null,null,"OK066","No"]
[null,null,null,null,"",null,null,null,null,null,null,null,null,null,null,null,null,null,null,null,null,"OK067","No"]
[null,null,null,null,"",null,null,null,null,null,null,null,null,null,null,null,null,null,null,null,null,"OK068","No"]
[null,null,null,null,"",null,null,null,null,null,null,null,null,null,null,null,null,null,null,null,null,"OK069","No"]
[null,null,null,null,"",null,null,null,null,null,null,null,null,null,null,null,null,null,null,null,null,"OK070","No"]
[null,null,null,null,"",null,null,null,null,null,null,null,null,null,null,null,null,null,null,null,null,"OK071","Yes"]
[null,null,null,null,"",null,null,null,null,null,null,null,null,null,null,null,null,null,null,null,null,"OK072","No"]
[null,null,null,null,"",null,null,null,null,null,null,null,null,null,null,null,null,null,null,null,null,"OK073","No"]
[null,null,null,null,"",null,null,null,null,null,null,null,null,null,null,null,null,null,null,null,null,"OK075","No"]
[null,null,null,null,"",null,null,null,null,null,null,null,null,null,null,null,null,null,null,null,null,"OK076","No"]
[null,null,null,null,"",null,null,null,null,null,null,null,null,null,null,null,null,null,null,null,null,"OK078","No"]
[null,null,null,null,"",null,null,null,null,null,null,null,null,null,null,null,null,null,null,null,null,"OK079","No"]
[null,null,null,null,"",null,null,null,null,null,null,null,null,null,null,null,null,null,null,null,null,"OK083","No"]
[null,null,null,null,"",null,null,null,null,null,null,null,null,null,null,null,null,null,null,null,null,"OK084","No"]
[null,null,null,null,"",null,null,null,null,null,null,null,null,null,null,null,null,null,null,null,null,"OK085","No"]
[null,null,null,null,"",null,null,null,null,null,null,null,null,null,null,null,null,null,null,null,null,"OK086","No"]
[null,null,null,null,"",null,null,null,null,null,null,null,null,null,null,null,null,null,null,null,null,"OK087","No"]
[null,null,null,null,"",null,null,null,null,null,null,null,null,null,null,null,null,null,null,null,null,"OK088","No"]
[null,null,null,null,"",null,null,null,null,null,null,null,null,null,null,null,null,null,null,null,null,"OK089","No"]
[null,null,null,null,"",null,null,null,null,null,null,null,null,null,null,null,null,null,null,null,null,"OK092","No"]
[null,null,null,null,"",null,null,null,null,null,null,null,null,null,null,null,null,null,null,null,null,"OK095","No"]
[null,null,null,null,"",null,null,null,null,null,null,null,null,null,null,null,null,null,null,null,null,"OK096","No"]
[null,null,null,null,"",null,null,null,null,null,null,null,null,null,null,null,null,null,null,null,null,"OK097","No"]
[null,null,null,null,"",null,null,null,null,null,null,null,null,null,null,null,null,null,null,null,null,"OK099","No"]
[null,null,null,null,"",null,null,null,null,null,null,null,null,null,null,null,null,null,null,null,null,"OK101","No"]
[null,null,null,null,"",null,null,null,null,null,null,null,null,null,null,null,null,null,null,null,null,"OK103","No"]
[null,null,null,null,"",null,null,null,null,null,null,null,null,null,null,null,null,null,null,null,null,"OK105","No"]
[null,null,null,null,"",null,null,null,null,null,null,null,null,null,null,null,null,null,null,null,null,"OK106","No"]
[null,null,null,null,"",null,null,null,null,null,null,null,null,null,null,null,null,null,null,null,null,"OK108","No"]
[null,null,null,null,"",null,null,null,null,null,null,null,null,null,null,null,null,null,null,null,null,"OK111","No"]
[null,null,null,null,"",null,null,null,null,null,null,null,null,null,null,null,null,null,null,null,null,"OK113","No"]
[null,null,null,null,"",null,null,null,null,null,null,null,null,null,null,null,null,null,null,null,null,"OK116","No"]
[null,null,null,null,"",null,null,null,null,null,null,null,null,null,null,null,null,null,null,null,null,"OK118","No"]
[null,null,null,null,"",null,null,null,null,null,null,null,null,null,null,null,null,null,null,null,null,"OK119","No"]
[null,null,null,null,"",null,null,null,null,null,null,null,null,null,null,null,null,null,null,null,null,"OK120","No"]
[null,null,null,null,"",null,null,null,null,null,null,null,null,null,null,null,null,null,null,null,null,"OK121","No"]
[null,null,null,null,"",null,null,null,null,null,null,null,null,null,null,null,null,null,null,null,null,"OK123","No"]
[null,null,null,null,"",null,null,null,null,null,null,null,null,null,null,null,null,null,null,null,null,"OK124","No"]
[null,null,null,null,"",null,null,null,null,null,null,null,null,null,null,null,null,null,null,null,null,"OK131","No"]
[null,null,null,null,"",null,null,null,null,null,null,null,null,null,null,null,null,null,null,null,null,"OK132","No"]
[null,null,null,null,"",null,null,null,null,null,null,null,null,null,null,null,null,null,null,null,null,"OK134","No"]
[null,null,null,null,"",null,null,null,null,null,null,null,null,null,null,null,null,null,null,null,null,"OK136","No"]
[null,null,null,null,"",null,null,null,null,null,null,null,null,null,null,null,null,null,null,null,null,"OK137","No"]
[null,null,null,null,"",null,null,null,null,null,null,null,null,null,null,null,null,null,null,null,null,"OK139","No"]
[null,null,null,null,"",null,null,null,null,null,null,null,null,null,null,null,null,null,null,null,null,"OK142","No"]
[null,null,null,null,"",null,null,null,null,null,null,null,null,null,null,null,null,null,null,null,null,"OK146","No"]
[null,null,null,null,"",null,null,null,null,null,null,null,null,null,null,null,null,null,null,null,null,"OK147","No"]
[null,null,null,null,"",null,null,null,null,null,null,null,null,null,null,null,null,null,null,null,null,"OK148","No"]
[null,null,null,null,"",null,null,null,null,null,null,null,null,null,null,null,null,null,null,null,null,"OK149","No"]
[null,null,null,null,"",null,null,null,null,null,null,null,null,null,null,null,null,null,null,null,null,"OK150","No"]
[null,null,null,null,"",null,null,null,null,null,null,null,null,null,null,null,null,null,null,null,null,"OK154","Yes"]
[null,null,null,null,"",null,null,null,null,null,null,null,null,null,null,null,null,null,null,null,null,"OR001","No"]
[null,null,null,null,"",null,null,null,null,null,null,null,null,null,null,null,null,null,null,null,null,"OR002","No"]
[null,null,null,null,"",null,null,null,null,null,null,null,null,null,null,null,null,null,null,null,null,"OR003","No"]
[null,null,null,null,"",null,null,null,null,null,null,null,null,null,null,null,null,null,null,null,null,"OR005","No"]
[null,null,null,null,{"$f":"LEFT(F2307,2)","v":""},null,null,null,null,null,null,null,null,null,null,null,null,null,null,null,null,"OR006","Yes"]
[null,null,null,null,"",null,null,null,null,null,null,null,null,null,null,null,null,null,null,null,null,"OR007","No"]
[null,null,null,null,"",null,null,null,null,null,null,null,null,null,null,null,null,null,null,null,null,"OR008","Yes"]
[null,null,null,null,"",null,null,null,null,null,null,null,null,null,null,null,null,null,null,null,null,"OR009","No"]
[null,null,null,null,"",null,null,null,null,null,null,null,null,null,null,null,null,null,null,null,null,"OR011","No"]
[null,null,null,null,"",null,null,null,null,null,null,null,null,null,null,null,null,null,null,null,null,"OR014","No"]
[null,null,null,null,"",null,null,null,null,null,null,null,null,null,null,null,null,null,null,null,null,"OR015","No"]
[null,null,null,null,"",null,null,null,null,null,null,null,null,null,null,null,null,null,null,null,null,"OR016","No"]
[null,null,null,null,"",null,null,null,null,null,null,null,null,null,null,null,null,null,null,null,null,"OR017","No"]
[null,null,null,null,"",null,null,null,null,null,null,null,null,null,null,null,null,null,null,null,null,"OR020","No"]
[null,null,null,null,"",null,null,null,null,null,null,null,null,null,null,null,null,null,null,null,null,"OR022","No"]
[null,null,null,null,"",null,null,null,null,null,null,null,null,null,null,null,null,null,null,null,null,"OR027","No"]
[null,null,null,null,"",null,null,null,null,null,null,null,null,null,null,null,null,null,null,null,null,"OR032","No"]
[null,null,null,null,"",null,null,null,null,null,null,null,null,null,null,null,null,null,null,null,null,"OR034","Yes"]
[null,null,null,null,"",null,null,null,null,null,null,null,null,null,null,null,null,null,null,null,null,"PA001","No"]
[null,null,null,null,"",null,null,null,null,null,null,null,null,null,null,null,null,null,null,null,null,"PA002","No"]
[null,null,null,null,"",null,null,null,null,null,null,null,null,null,null,null,null,null,null,null,null,"PA003","No"]
[null,null,null,null,"",null,null,null,null,null,null,null,null,null,null,null,null,null,null,null,null,"PA004","No"]
[null,null,null,null,"",null,null,null,null,null,null,null,null,null,null,null,null,null,null,null,null,"PA005","No"]
[null,null,null,null,"",null,null,null,null,null,null,null,null,null,null,null,null,null,null,null,null,"PA006","No"]
[null,null,null,null,"",null,null,null,null,null,null,null,null,null,null,null,null,null,null,null,null,"PA007","No"]
[null,null,null,null,"",null,null,null,null,null,null,null,null,null,null,null,null,null,null,null,null,"PA008","Yes"]
[null,null,null,null,"",null,null,null,null,null,null,null,null,null,null,null,null,null,null,null,null,"PA009","No"]
[null,null,null,null,"",null,null,null,null,null,null,null,null,null,null,null,null,null,null,null,null,"PA010","No"]
[null,null,null,null,"",null,null,null,null,null,null,null,null,null,null,null,null,null,null,null,null,"PA011","No"]
[null,null,null,null,"",null,null,null,null,null,null,null,null,null,null,null,null,null,null,null,null,"PA012","Yes"]
[null,null,null,null,"",null,null,null,null,null,null,null,null,null,null,null,null,null,null,null,null,"PA013","No"]
[null,null,null,null,"",null,null,null,null,null,null,null,null,null,null,null,null,null,null,null,null,"PA014","No"]
[null,null,null,null,"",null,null,null,null,null,null,null,null,null,null,null,null,null,null,null,null,"PA015","No"]
[null,null,null,null,"",null,null,null,null,null,null,null,null,null,null,null,null,null,null,null,null,"PA016","No"]
[null,null,null,null,"",null,null,null,null,null,null,null,null,null,null,null,null,null,null,null,null,"PA017","No"]
[null,null,null,null,"",null,null,null,null,null,null,null,null,null,null,null,null,null,null,null,null,"PA018","No"]
[null,null,null,null,"",null,null,null,null,null,null,null,null,null,null,null,null,null,null,null,null,"PA019","No"]
[null,null,null,null,"",null,null,null,null,null,null,null,null,null,null,null,null,null,null,null,null,"PA020","Yes"]
[null,null,null,null,"",null,null,null,null,null,null,null,null,null,null,null,null,null,null,null,null,"PA021","No"]
[null,null,null,null,"",null,null,null,null,null,null,null,null,null,null,null,null,null,null,null,null,"PA022","No"]
[null,null,null,null,"",null,null,null,null,null,null,null,null,null,null,null,null,null,null,null,null,"PA023","No"]
[null,null,null,null,"",null,null,null,null,null,null,null,null,null,null,null,null,null,null,null,null,"PA024","No"]
[null,null,null,null,"",null,null,null,null,null,null,null,null,null,null,null,null,null,null,null,null,"PA025","No"]
[null,null,null,null,"",null,null,null,null,null,null,null,null,null,null,null,null,null,null,null,null,"PA026","No"]
[null,null,null,null,"",null,null,null,null,null,null,null,null,null,null,null,null,null,null,null,null,"PA027","No"]
[null,null,null,null,"",null,null,null,null,null,null,null,null,null,null,null,null,null,null,null,null,"PA028","No"]
[null,null,null,null,"",null,null,null,null,null,null,null,null,null,null,null,null,null,null,null,null,"PA029","Yes"]
[null,null,null,null,"",null,null,null,null,null,null,null,null,null,null,null,null,null,null,null,null,"PA030","No"]
[null,null,null,null,"",null,null,null,null,null,null,null,null,null,null,null,null,null,null,null,null,"PA031","No"]
[null,null,null,null,"",null,null,null,null,null,null,null,null,null,null,null,null,null,null,null,null,"PA032","No"]
[null,null,null,null,"",null,null,null,null,null,null,null,null,null,null,null,null,null,null,null,null,"PA033","Yes"]
[null,null,null,null,"",null,null,null,null,null,null,null,null,null,null,null,null,null,null,null,null,"PA034","Yes"]
[null,null,null,null,"",null,null,null,null,null,null,null,null,null,null,null,null,null,null,null,null,"PA035","No"]
[null,null,null,null,"",null,null,null,null,null,null,null,null,null,null,null,null,null,null,null,null,"PA036","No"]
[null,null,null,null,"",null,null,null,null,null,null,null,null,null,null,null,null,null,null,null,null,"PA037","No"]
[null,null,null,null,"",null,null,null,null,null,null,null,null,null,null,null,null,null,null,null,null,"PA038","No"]
[null,null,null,null,"",null,null,null,null,null,null,null,null,null,null,null,null,null,null,null,null,"PA039","No"]
[null,null,null,null,"",null,null,null,null,null,null,null,null,null,null,null,null,null,null,null,null,"PA040","No"]
[null,null,null,null,"",null,null,null,null,null,null,null,null,null,null,null,null,null,null,null,null,"PA041","No"]
[null,null,null,null,"",null,null,null,null,null,null,null,null,null,null,null,null,null,null,null,null,"PA042","No"]
[null,null,null,null,"",null,null,null,null,null,null,null,null,null,null,null,null,null,null,null,null,"PA043","No"]
[null,null,null,null,"",null,null,null,null,null,null,null,null,null,null,null,null,null,null,null,null,"PA044","No"]
[null,null,null,null,"",null,null,null,null,null,null,null,null,null,null,null,null,null,null,null,null,"PA045","No"]
[null,null,null,null,"",null,null,null,null,null,null,null,null,null,null,null,null,null,null,null,null,"PA046","No"]
[null,null,null,null,"",null,null,null,null,null,null,null,null,null,null,null,null,null,null,null,null,"PA047","No"]
[null,null,null,null,"",null,null,null,null,null,null,null,null,null,null,null,null,null,null,null,null,"PA048","No"]
[null,null,null,null,"",null,null,null,null,null,null,null,null,null,null,null,null,null,null,null,null,"PA049","No"]
[null,null,null,null,"",null,null,null,null,null,null,null,null,null,null,null,null,null,null,null,null,"PA050","No"]
[null,null,null,null,{"$f":"LEFT(F2371,2)","v":""},null,null,null,null,null,null,null,null,null,null,null,null,null,null,null,null,"PA051","No"]
[null,null,null,null,"",null,null,null,null,null,null,null,null,null,null,null,null,null,null,null,null,"PA052","No"]
[null,null,null,null,"",null,null,null,null,null,null,null,null,null,null,null,null,null,null,null,null,"PA053","No"]
[null,null,null,null,"",null,null,null,null,null,null,null,null,null,null,null,null,null,null,null,null,"PA054","No"]
[null,null,null,null,"",null,null,null,null,null,null,null,null,null,null,null,null,null,null,null,null,"PA055","No"]
[null,null,null,null,"",null,null,null,null,null,null,null,null,null,null,null,null,null,null,null,null,"PA056","No"]
[null,null,null,null,"",null,null,null,null,null,null,null,null,null,null,null,null,null,null,null,null,"PA057","No"]
[null,null,null,null,"",null,null,null,null,null,null,null,null,null,null,null,null,null,null,null,null,"PA058","Yes"]
[null,null,null,null,"",null,null,null,null,null,null,null,null,null,null,null,null,null,null,null,null,"PA059","No"]
[null,null,null,null,"",null,null,null,null,null,null,null,null,null,null,null,null,null,null,null,null,"PA060","No"]
[null,null,null,null,"",null,null,null,null,null,null,null,null,null,null,null,null,null,null,null,null,"PA061","No"]
[null,null,null,null,"",null,null,null,null,null,null,null,null,null,null,null,null,null,null,null,null,"PA063","No"]
[null,null,null,null,"",null,null,null,null,null,null,null,null,null,null,null,null,null,null,null,null,"PA064","No"]
[null,null,null,null,"",null,null,null,null,null,null,null,null,null,null,null,null,null,null,null,null,"PA065","No"]
[null,null,null,null,"",null,null,null,null,null,null,null,null,null,null,null,null,null,null,null,null,"PA066","No"]
[null,null,null,null,"",null,null,null,null,null,null,null,null,null,null,null,null,null,null,null,null,"PA067","No"]
[null,null,null,null,"",null,null,null,null,null,null,null,null,null,null,null,null,null,null,null,null,"PA069","No"]
[null,null,null,null,"",null,null,null,null,null,null,null,null,null,null,null,null,null,null,null,null,"PA071","No"]
[null,null,null,null,"",null,null,null,null,null,null,null,null,null,null,null,null,null,null,null,null,"PA073","No"]
[null,null,null,null,"",null,null,null,null,null,null,null,null,null,null,null,null,null,null,null,null,"PA074","No"]
[null,null,null,null,"",null,null,null,null,null,null,null,null,null,null,null,null,null,null,null,null,"PA075","No"]
[null,null,null,null,"",null,null,null,null,null,null,null,null,null,null,null,null,null,null,null,null,"PA076","No"]
[null,null,null,null,"",null,null,null,null,null,null,null,null,null,null,null,null,null,null,null,null,"PA079","No"]
[null,null,null,null,"",null,null,null,null,null,null,null,null,null,null,null,null,null,null,null,null,"PA080","No"]
[null,null,null,null,"",null,null,null,null,null,null,null,null,null,null,null,null,null,null,null,null,"PA081","No"]
[null,null,null,null,"",null,null,null,null,null,null,null,null,null,null,null,null,null,null,null,null,"PA083","No"]
[null,null,null,null,"",null,null,null,null,null,null,null,null,null,null,null,null,null,null,null,null,"PA085","No"]
[null,null,null,null,"",null,null,null,null,null,null,null,null,null,null,null,null,null,null,null,null,"PA086","No"]
[null,null,null,null,"",null,null,null,null,null,null,null,null,null,null,null,null,null,null,null,null,"PA087","No"]
[null,null,null,null,"",null,null,null,null,null,null,null,null,null,null,null,null,null,null,null,null,"PA088","No"]
[null,null,null,null,"",null,null,null,null,null,null,null,null,null,null,null,null,null,null,null,null,"PA089","Yes"]
[null,null,null,null,"",null,null,null,null,null,null,null,null,null,null,null,null,null,null,null,null,"PA092","Yes"]
[null,null,null,null,"",null,null,null,null,null,null,null,null,null,null,null,null,null,null,null,null,"RI001","Yes"]
[null,null,null,null,"",null,null,null,null,null,null,null,null,null,null,null,null,null,null,null,null,"RI002","No"]
[null,null,null,null,"",null,null,null,null,null,null,null,null,null,null,null,null,null,null,null,null,"RI003","Yes"]
[null,null,null,null,"",null,null,null,null,null,null,null,null,null,null,null,null,null,null,null,null,"RI004","Yes"]
[null,null,null,null,"",null,null,null,null,null,null,null,null,null,null,null,null,null,null,null,null,"RI005","No"]
[null,null,null,null,"",null,null,null,null,null,null,null,null,null,null,null,null,null,null,null,null,"RI006","No"]
[null,null,null,null,"",null,null,null,null,null,null,null,null,null,null,null,null,null,null,null,null,"RI007","No"]
[null,null,null,null,"",null,null,null,null,null,null,null,null,null,null,null,null,null,null,null,null,"RI008","Yes"]
[null,null,null,null,"",null,null,null,null,null,null,null,null,null,null,null,null,null,null,null,null,"RI009","No"]
[null,null,null,null,"",null,null,null,null,null,null,null,null,null,null,null,null,null,null,null,null,"RI010","No"]
[null,null,null,null,"",null,null,null,null,null,null,null,null,null,null,null,null,null,null,null,null,"RI011","No"]
[null,null,null,null,"",null,null,null,null,null,null,null,null,null,null,null,null,null,null,null,null,"RI012","No"]
[null,null,null,null,"",null,null,null,null,null,null,null,null,null,null,null,null,null,null,null,null,"RI013","No"]
[null,null,null,null,"",null,null,null,null,null,null,null,null,null,null,null,null,null,null,null,null,"RI014","No"]
[null,null,null,null,"",null,null,null,null,null,null,null,null,null,null,null,null,null,null,null,null,"RI015","No"]
[null,null,null,null,"",null,null,null,null,null,null,null,null,null,null,null,null,null,null,null,null,"RI016","No"]
[null,null,null,null,"",null,null,null,null,null,null,null,null,null,null,null,null,null,null,null,null,"RI017","No"]
[null,null,null,null,"",null,null,null,null,null,null,null,null,null,null,null,null,null,null,null,null,"RI018","No"]
[null,null,null,null,"",null,null,null,null,null,null,null,null,null,null,null,null,null,null,null,null,"RI019","No"]
[null,null,null,null,"",null,null,null,null,null,null,null,null,null,null,null,null,null,null,null,null,"RI020","No"]
[null,null,null,null,"",null,null,null,null,null,null,null,null,null,null,null,null,null,null,null,null,"RI021","No"]
[null,null,null,null,"",null,null,null,null,null,null,null,null,null,null,null,null,null,null,null,null,"RI022","No"]
[null,null,null,null,"",null,null,null,null,null,null,null,null,null,null,null,null,null,null,null,null,"RI024","No"]
[null,null,null,null,"",null,null,null,null,null,null,null,null,null,null,null,null,null,null,null,null,"RI026","No"]
[null,null,null,null,"",null,null,null,null,null,null,null,null,null,null,null,null,null,null,null,null,"RI027","Yes"]
[null,null,null,null,"",null,null,null,null,null,null,null,null,null,null,null,null,null,null,null,null,"RQ005","Yes"]
[null,null,null,null,"",null,null,null,null,null,null,null,null,null,null,null,null,null,null,null,null,"SC001","Yes"]
[null,null,null,null,"",null,null,null,null,null,null,null,null,null,null,null,null,null,null,null,null,"SC002","No"]
[null,null,null,null,"",null,null,null,null,null,null,null,null,null,null,null,null,null,null,null,null,"SC003","No"]
[null,null,null,null,"",null,null,null,null,null,null,null,null,null,null,null,null,null,null,null,null,"SC004","No"]
[null,null,null,null,"",null,null,null,null,null,null,null,null,null,null,null,null,null,null,null,null,"SC005","No"]
[null,null,null,null,"",null,null,null,null,null,null,null,null,null,null,null,null,null,null,null,null,"SC007","No"]
[null,null,null,null,{"$f":"LEFT(F2435,2)","v":""},null,null,null,null,null,null,null,null,null,null,null,null,null,null,null,null,"SC008","No"]
[null,null,null,null,"",null,null,null,null,null,null,null,null,null,null,null,null,null,null,null,null,"SC011","No"]
[null,null,null,null,"",null,null,null,null,null,null,null,null,null,null,null,null,null,null,null,null,"SC012","No"]
[null,null,null,null,"",null,null,null,null,null,null,null,null,null,null,null,null,null,null,null,null,"SC015","No"]
[null,null,null,null,"",null,null,null,null,null,null,null,null,null,null,null,null,null,null,null,null,"SC016","No"]
[null,null,null,null,"",null,null,null,null,null,null,null,null,null,null,null,null,null,null,null,null,"SC017","No"]
[null,null,null,null,"",null,null,null,null,null,null,null,null,null,null,null,null,null,null,null,null,"SC018","No"]
[null,null,null,null,"",null,null,null,null,null,null,null,null,null,null,null,null,null,null,null,null,"SC019","No"]
[null,null,null,null,"",null,null,null,null,null,null,null,null,null,null,null,null,null,null,null,null,"SC020","No"]
[null,null,null,null,"",null,null,null,null,null,null,null,null,null,null,null,null,null,null,null,null,"SC021","No"]
[null,null,null,null,"",null,null,null,null,null,null,null,null,null,null,null,null,null,null,null,null,"SC022","No"]
[null,null,null,null,"",null,null,null,null,null,null,null,null,null,null,null,null,null,null,null,null,"SC023","No"]
[null,null,null,null,"",null,null,null,null,null,null,null,null,null,null,null,null,null,null,null,null,"SC024","No"]
[null,null,null,null,"",null,null,null,null,null,null,null,null,null,null,null,null,null,null,null,null,"SC025","No"]
[null,null,null,null,"",null,null,null,null,null,null,null,null,null,null,null,null,null,null,null,null,"SC026","No"]
[null,null,null,null,"",null,null,null,null,null,null,null,null,null,null,null,null,null,null,null,null,"SC027","No"]
[null,null,null,null,"",null,null,null,null,null,null,null,null,null,null,null,null,null,null,null,null,"SC028","No"]
[null,null,null,null,"",null,null,null,null,null,null,null,null,null,null,null,null,null,null,null,null,"SC029","No"]
[null,null,null,null,"",null,null,null,null,null,null,null,null,null,null,null,null,null,null,null,null,"SC030","No"]
[null,null,null,null,"",null,null,null,null,null,null,null,null,null,null,null,null,null,null,null,null,"SC031","No"]
[null,null,null,null,"",null,null,null,null,null,null,null,null,null,null,null,null,null,null,null,null,"SC032","No"]
[null,null,null,null,"",null,null,null,null,null,null,null,null,null,null,null,null,null,null,null,null,"SC033","No"]
[null,null,null,null,"",null,null,null,null,null,null,null,null,null,null,null,null,null,null,null,null,"SC035","No"]
[null,null,null,null,"",null,null,null,null,null,null,null,null,null,null,null,null,null,null,null,null,"SC036","No"]
[null,null,null,null,"",null,null,null,null,null,null,null,null,null,null,null,null,null,null,null,null,"SC037","No"]
[null,null,null,null,"",null,null,null,null,null,null,null,null,null,null,null,null,null,null,null,null,"SC039","No"]
[null,null,null,null,"",null,null,null,null,null,null,null,null,null,null,null,null,null,null,null,null,"SC040","No"]
[null,null,null,null,"",null,null,null,null,null,null,null,null,null,null,null,null,null,null,null,null,"SC046","No"]
[null,null,null,null,"",null,null,null,null,null,null,null,null,null,null,null,null,null,null,null,null,"SC048","No"]
[null,null,null,null,"",null,null,null,null,null,null,null,null,null,null,null,null,null,null,null,null,"SC053","No"]
[null,null,null,null,"",null,null,null,null,null,null,null,null,null,null,null,null,null,null,null,null,"SC056","No"]
[null,null,null,null,"",null,null,null,null,null,null,null,null,null,null,null,null,null,null,null,null,"SC057","No"]
[null,null,null,null,"",null,null,null,null,null,null,null,null,null,null,null,null,null,null,null,null,"SC059","No"]
[null,null,null,null,"",null,null,null,null,null,null,null,null,null,null,null,null,null,null,null,null,"SC060","No"]
[null,null,null,null,"",null,null,null,null,null,null,null,null,null,null,null,null,null,null,null,null,"SC061","No"]
[null,null,null,null,"",null,null,null,null,null,null,null,null,null,null,null,null,null,null,null,null,"SD007","No"]
[null,null,null,null,"",null,null,null,null,null,null,null,null,null,null,null,null,null,null,null,null,"SD008","No"]
[null,null,null,null,"",null,null,null,null,null,null,null,null,null,null,null,null,null,null,null,null,"SD009","No"]
[null,null,null,null,"",null,null,null,null,null,null,null,null,null,null,null,null,null,null,null,null,"SD010","No"]
[null,null,null,null,"",null,null,null,null,null,null,null,null,null,null,null,null,null,null,null,null,"SD011","No"]
[null,null,null,null,"",null,null,null,null,null,null,null,null,null,null,null,null,null,null,null,null,"SD013","No"]
[null,null,null,null,"",null,null,null,null,null,null,null,null,null,null,null,null,null,null,null,null,"SD014","No"]
[null,null,null,null,"",null,null,null,null,null,null,null,null,null,null,null,null,null,null,null,null,"SD016","No"]
[null,null,null,null,"",null,null,null,null,null,null,null,null,null,null,null,null,null,null,null,null,"SD017","No"]
[null,null,null,null,"",null,null,null,null,null,null,null,null,null,null,null,null,null,null,null,null,"SD018","No"]
[null,null,null,null,"",null,null,null,null,null,null,null,null,null,null,null,null,null,null,null,null,"SD019","No"]
[null,null,null,null,"",null,null,null,null,null,null,null,null,null,null,null,null,null,null,null,null,"SD020","No"]
[null,null,null,null,"",null,null,null,null,null,null,null,null,null,null,null,null,null,null,null,null,"SD021","No"]
[null,null,null,null,"",null,null,null,null,null,null,null,null,null,null,null,null,null,null,null,null,"SD022","No"]
[null,null,null,null,"",null,null,null,null,null,null,null,null,null,null,null,null,null,null,null,null,"SD023","No"]
[null,null,null,null,"",null,null,null,null,null,null,null,null,null,null,null,null,null,null,null,null,"SD024","No"]
[null,null,null,null,"",null,null,null,null,null,null,null,null,null,null,null,null,null,null,null,null,"SD025","No"]
[null,null,null,null,"",null,null,null,null,null,null,null,null,null,null,null,null,null,null,null,null,"SD031","No"]
[null,null,null,null,"",null,null,null,null,null,null,null,null,null,null,null,null,null,null,null,null,"SD034","No"]
[null,null,null,null,"",null,null,null,null,null,null,null,null,null,null,null,null,null,null,null,null,"SD035","No"]
[null,null,null,null,"",null,null,null,null,null,null,null,null,null,null,null,null,null,null,null,null,"SD038","No"]
[null,null,null,null,"",null,null,null,null,null,null,null,null,null,null,null,null,null,null,null,null,"SD039","No"]
[null,null,null,null,"",null,null,null,null,null,null,null,null,null,null,null,null,null,null,null,null,"SD040","No"]
[null,null,null,null,"",null,null,null,null,null,null,null,null,null,null,null,null,null,null,null,null,"SD043","No"]
[null,null,null,null,"",null,null,null,null,null,null,null,null,null,null,null,null,null,null,null,null,"SD045","Yes"]
[null,null,null,null,"",null,null,null,null,null,null,null,null,null,null,null,null,null,null,null,null,"SD047","No"]
[null,null,null,null,"",null,null,null,null,null,null,null,null,null,null,null,null,null,null,null,null,"TN001","Yes"]
[null,null,null,null,"",null,null,null,null,null,null,null,null,null,null,null,null,null,null,null,null,"TN002","Yes"]
[null,null,null,null,"",null,null,null,null,null,null,null,null,null,null,null,null,null,null,null,null,"TN003","Yes"]
[null,null,null,null,{"$f":"LEFT(F2499,2)","v":""},null,null,null,null,null,null,null,null,null,null,null,null,null,null,null,null,"TN004","No"]
[null,null,null,null,"",null,null,null,null,null,null,null,null,null,null,null,null,null,null,null,null,"TN005","No"]
[null,null,null,null,"",null,null,null,null,null,null,null,null,null,null,null,null,null,null,null,null,"TN006","No"]
[null,null,null,null,"",null,null,null,null,null,null,null,null,null,null,null,null,null,null,null,null,"TN007","No"]
[null,null,null,null,"",null,null,null,null,null,null,null,null,null,null,null,null,null,null,null,null,"TN008","No"]
[null,null,null,null,"",null,null,null,null,null,null,null,null,null,null,null,null,null,null,null,null,"TN009","No"]
[null,null,null,null,"",null,null,null,null,null,null,null,null,null,null,null,null,null,null,null,null,"TN010","No"]
[null,null,null,null,"",null,null,null,null,null,null,null,null,null,null,null,null,null,null,null,null,"TN011","No"]
[null,null,null,null,"",null,null,null,null,null,null,null,null,null,null,null,null,null,null,null,null,"TN012","No"]
[null,null,null,null,"",null,null,null,null,null,null,null,null,null,null,null,null,null,null,null,null,"TN013","No"]
[null,null,null,null,"",null,null,null,null,null,null,null,null,null,null,null,null,null,null,null,null,"TN014","No"]
[null,null,null,null,"",null,null,null,null,null,null,null,null,null,null,null,null,null,null,null,null,"TN015","No"]
[null,null,null,null,"",null,null,null,null,null,null,null,null,null,null,null,null,null,null,null,null,"TN016","No"]
[null,null,null,null,"",null,null,null,null,null,null,null,null,null,null,null,null,null,null,null,null,"TN017","No"]
[null,null,null,null,"",null,null,null,null,null,null,null,null,null,null,null,null,null,null,null,null,"TN018","No"]
[null,null,null,null,"",null,null,null,null,null,null,null,null,null,null,null,null,null,null,null,null,"TN019","No"]
[null,null,null,null,"",null,null,null,null,null,null,null,null,null,null,null,null,null,null,null,null,"TN020","No"]
[null,null,null,null,"",null,null,null,null,null,null,null,null,null,null,null,null,null,null,null,null,"TN021","No"]
[null,null,null,null,"",null,null,null,null,null,null,null,null,null,null,null,null,null,null,null,null,"TN022","No"]
[null,null,null,null,"",null,null,null,null,null,null,null,null,null,null,null,null,null,null,null,null,"TN024","No"]
[null,null,null,null,"",null,null,null,null,null,null,null,null,null,null,null,null,null,null,null,null,"TN025","No"]
[null,null,null,null,"",null,null,null,null,null,null,null,null,null,null,null,null,null,null,null,null,"TN026","No"]
[null,null,null,null,"",null,null,null,null,null,null,null,null,null,null,null,null,null,null,null,null,"TN027","No"]
[null,null,null,null,"",null,null,null,null,null,null,null,null,null,null,null,null,null,null,null,null,"TN028","No"]
[null,null,null,null,"",null,null,null,null,null,null,null,null,null,null,null,null,null,null,null,null,"TN029","No"]
[null,null,null,null,"",null,null,null,null,null,null,null,null,null,null,null,null,null,null,null,null,"TN030","No"]
[null,null,null,null,"",null,null,null,null,null,null,null,null,null,null,null,null,null,null,null,null,"TN031","No"]
[null,null,null,null,"",null,null,null,null,null,null,null,null,null,null,null,null,null,null,null,null,"TN032","No"]
[null,null,null,null,"",null,null,null,null,null,null,null,null,null,null,null,null,null,null,null,null,"TN033","No"]
[null,null,null,null,"",null,null,null,null,null,null,null,null,null,null,null,null,null,null,null,null,"TN034","No"]
[null,null,null,null,"",null,null,null,null,null,null,null,null,null,null,null,null,null,null,null,null,"TN035","No"]
[null,null,null,null,"",null,null,null,null,null,null,null,null,null,null,null,null,null,null,null,null,"TN036","No"]
[null,null,null,null,"",null,null,null,null,null,null,null,null,null,null,null,null,null,null,null,null,"TN037","No"]
[null,null,null,null,"",null,null,null,null,null,null,null,null,null,null,null,null,null,null,null,null,"TN038","No"]
[null,null,null,null,"",null,null,null,null,null,null,null,null,null,null,null,null,null,null,null,null,"TN039","No"]
[null,null,null,null,"",null,null,null,null,null,null,null,null,null,null,null,null,null,null,null,null,"TN040","No"]
[null,null,null,null,"",null,null,null,null,null,null,null,null,null,null,null,null,null,null,null,null,"TN041","No"]
[null,null,null,null,"",null,null,null,null,null,null,null,null,null,null,null,null,null,null,null,null,"TN042","No"]
[null,null,null,null,"",null,null,null,null,null,null,null,null,null,null,null,null,null,null,null,null,"TN043","No"]
[null,null,null,null,"",null,null,null,null,null,null,null,null,null,null,null,null,null,null,null,null,"TN044","No"]
[null,null,null,null,"",null,null,null,null,null,null,null,null,null,null,null,null,null,null,null,null,"TN045","No"]
[null,null,null,null,"",null,null,null,null,null,null,null,null,null,null,null,null,null,null,null,null,"TN046","No"]
[null,null,null,null,"",null,null,null,null,null,null,null,null,null,null,null,null,null,null,null,null,"TN047","No"]
[null,null,null,null,"",null,null,null,null,null,null,null,null,null,null,null,null,null,null,null,null,"TN048","No"]
[null,null,null,null,"",null,null,null,null,null,null,null,null,null,null,null,null,null,null,null,null,"TN049","No"]
[null,null,null,null,"",null,null,null,null,null,null,null,null,null,null,null,null,null,null,null,null,"TN050","No"]
[null,null,null,null,"",null,null,null,null,null,null,null,null,null,null,null,null,null,null,null,null,"TN051","No"]
[null,null,null,null,"",null,null,null,null,null,null,null,null,null,null,null,null,null,null,null,null,"TN052","No"]
[null,null,null,null,"",null,null,null,null,null,null,null,null,null,null,null,null,null,null,null,null,"TN053","No"]
[null,null,null,null,"",null,null,null,null,null,null,null,null,null,null,null,null,null,null,null,null,"TN054","No"]
[null,null,null,null,"",null,null,null,null,null,null,null,null,null,null,null,null,null,null,null,null,"TN055","No"]
[null,null,null,null,"",null,null,null,null,null,null,null,null,null,null,null,null,null,null,null,null,"TN056","No"]
[null,null,null,null,"",null,null,null,null,null,null,null,null,null,null,null,null,null,null,null,null,"TN057","No"]
[null,null,null,null,"",null,null,null,null,null,null,null,null,null,null,null,null,null,null,null,null,"TN058","No"]
[null,null,null,null,"",null,null,null,null,null,null,null,null,null,null,null,null,null,null,null,null,"TN059","No"]
[null,null,null,null,"",null,null,null,null,null,null,null,null,null,null,null,null,null,null,null,null,"TN060","No"]
[null,null,null,null,"",null,null,null,null,null,null,null,null,null,null,null,null,null,null,null,null,"TN061","No"]
[null,null,null,null,"",null,null,null,null,null,null,null,null,null,null,null,null,null,null,null,null,"TN062","No"]
[null,null,null,null,"",null,null,null,null,null,null,null,null,null,null,null,null,null,null,null,null,"TN063","No"]
[null,null,null,null,"",null,null,null,null,null,null,null,null,null,null,null,null,null,null,null,null,"TN064","No"]
[null,null,null,null,"",null,null,null,null,null,null,null,null,null,null,null,null,null,null,null,null,"TN065","No"]
[null,null,null,null,"",null,null,null,null,null,null,null,null,null,null,null,null,null,null,null,null,"TN066","No"]
[null,null,null,null,"",null,null,null,null,null,null,null,null,null,null,null,null,null,null,null,null,"TN068","No"]
[null,null,null,null,"",null,null,null,null,null,null,null,null,null,null,null,null,null,null,null,null,"TN069","No"]
[null,null,null,null,{"$f":"LEFT(F2563,2)","v":""},null,null,null,null,null,null,null,null,null,null,null,null,null,null,null,null,"TN071","No"]
[null,null,null,null,"",null,null,null,null,null,null,null,null,null,null,null,null,null,null,null,null,"TN072","No"]
[null,null,null,null,"",null,null,null,null,null,null,null,null,null,null,null,null,null,null,null,null,"TN073","No"]
[null,null,null,null,"",null,null,null,null,null,null,null,null,null,null,null,null,null,null,null,null,"TN074","No"]
[null,null,null,null,"",null,null,null,null,null,null,null,null,null,null,null,null,null,null,null,null,"TN075","No"]
[null,null,null,null,"",null,null,null,null,null,null,null,null,null,null,null,null,null,null,null,null,"TN076","No"]
[null,null,null,null,"",null,null,null,null,null,null,null,null,null,null,null,null,null,null,null,null,"TN077","No"]
[null,null,null,null,"",null,null,null,null,null,null,null,null,null,null,null,null,null,null,null,null,"TN078","No"]
[null,null,null,null,"",null,null,null,null,null,null,null,null,null,null,null,null,null,null,null,null,"TN079","No"]
[null,null,null,null,"",null,null,null,null,null,null,null,null,null,null,null,null,null,null,null,null,"TN081","No"]
[null,null,null,null,"",null,null,null,null,null,null,null,null,null,null,null,null,null,null,null,null,"TN082","No"]
[null,null,null,null,"",null,null,null,null,null,null,null,null,null,null,null,null,null,null,null,null,"TN084","No"]
[null,null,null,null,"",null,null,null,null,null,null,null,null,null,null,null,null,null,null,null,null,"TN088","No"]
[null,null,null,null,"",null,null,null,null,null,null,null,null,null,null,null,null,null,null,null,null,"TN090","No"]
[null,null,null,null,"",null,null,null,null,null,null,null,null,null,null,null,null,null,null,null,null,"TN092","No"]
[null,null,null,null,"",null,null,null,null,null,null,null,null,null,null,null,null,null,null,null,null,"TN095","No"]
[null,null,null,null,"",null,null,null,null,null,null,null,null,null,null,null,null,null,null,null,null,"TN111","Yes"]
[null,null,null,null,"",null,null,null,null,null,null,null,null,null,null,null,null,null,null,null,null,"TN125","No"]
[null,null,null,null,"",null,null,null,null,null,null,null,null,null,null,null,null,null,null,null,null,"TX001","Yes"]
[null,null,null,null,"",null,null,null,null,null,null,null,null,null,null,null,null,null,null,null,null,"TX003","Yes"]
[null,null,null,null,"",null,null,null,null,null,null,null,null,null,null,null,null,null,null,null,null,"TX004","Yes"]
[null,null,null,null,"",null,null,null,null,null,null,null,null,null,null,null,null,null,null,null,null,"TX005","Yes"]
[null,null,null,null,"",null,null,null,null,null,null,null,null,null,null,null,null,null,null,null,null,"TX006","Yes"]
[null,null,null,null,"",null,null,null,null,null,null,null,null,null,null,null,null,null,null,null,null,"TX007","Yes"]
[null,null,null,null,"",null,null,null,null,null,null,null,null,null,null,null,null,null,null,null,null,"TX008","Yes"]
[null,null,null,null,"",null,null,null,null,null,null,null,null,null,null,null,null,null,null,null,null,"TX009","Yes"]
[null,null,null,null,"",null,null,null,null,null,null,null,null,null,null,null,null,null,null,null,null,"TX010","No"]
[null,null,null,null,"",null,null,null,null,null,null,null,null,null,null,null,null,null,null,null,null,"TX011","No"]
[null,null,null,null,"",null,null,null,null,null,null,null,null,null,null,null,null,null,null,null,null,"TX012","No"]
[null,null,null,null,"",null,null,null,null,null,null,null,null,null,null,null,null,null,null,null,null,"TX014","No"]
[null,null,null,null,"",null,null,null,null,null,null,null,null,null,null,null,null,null,null,null,null,"TX015","Yes"]
[null,null,null,null,"",null,null,null,null,null,null,null,null,null,null,null,null,null,null,null,null,"TX016","No"]
[null,null,null,null,"",null,null,null,null,null,null,null,null,null,null,null,null,null,null,null,null,"TX017","No"]
[null,null,null,null,"",null,null,null,null,null,null,null,null,null,null,null,null,null,null,null,null,"TX018","No"]
[null,null,null,null,"",null,null,null,null,null,null,null,null,null,null,null,null,null,null,null,null,"TX019","No"]
[null,null,null,null,"",null,null,null,null,null,null,null,null,null,null,null,null,null,null,null,null,"TX020","No"]
[null,null,null,null,"",null,null,null,null,null,null,null,null,null,null,null,null,null,null,null,null,"TX021","Yes"]
[null,null,null,null,"",null,null,null,null,null,null,null,null,null,null,null,null,null,null,null,null,"TX022","No"]
[null,null,null,null,"",null,null,null,null,null,null,null,null,null,null,null,null,null,null,null,null,"TX023","No"]
[null,null,null,null,"",null,null,null,null,null,null,null,null,null,null,null,null,null,null,null,null,"TX024","No"]
[null,null,null,null,"",null,null,null,null,null,null,null,null,null,null,null,null,null,null,null,null,"TX025","No"]
[null,null,null,null,"",null,null,null,null,null,null,null,null,null,null,null,null,null,null,null,null,"TX026","No"]
[null,null,null,null,"",null,null,null,null,null,null,null,null,null,null,null,null,null,null,null,null,"TX027","No"]
[null,null,null,null,"",null,null,null,null,null,null,null,null,null,null,null,null,null,null,null,null,"TX028","Yes"]
[null,null,null,null,"",null,null,null,null,null,null,null,null,null,null,null,null,null,null,null,null,"TX029","No"]
[null,null,null,null,"",null,null,null,null,null,null,null,null,null,null,null,null,null,null,null,null,"TX030","No"]
[null,null,null,null,"",null,null,null,null,null,null,null,null,null,null,null,null,null,null,null,null,"TX031","No"]
[null,null,null,null,"",null,null,null,null,null,null,null,null,null,null,null,null,null,null,null,null,"TX032","No"]
[null,null,null,null,"",null,null,null,null,null,null,null,null,null,null,null,null,null,null,null,null,"TX033","No"]
[null,null,null,null,"",null,null,null,null,null,null,null,null,null,null,null,null,null,null,null,null,"TX034","No"]
[null,null,null,null,"",null,null,null,null,null,null,null,null,null,null,null,null,null,null,null,null,"TX035","No"]
[null,null,null,null,"",null,null,null,null,null,null,null,null,null,null,null,null,null,null,null,null,"TX036","No"]
[null,null,null,null,"",null,null,null,null,null,null,null,null,null,null,null,null,null,null,null,null,"TX037","No"]
[null,null,null,null,"",null,null,null,null,null,null,null,null,null,null,null,null,null,null,null,null,"TX038","No"]
[null,null,null,null,"",null,null,null,null,null,null,null,null,null,null,null,null,null,null,null,null,"TX039","No"]
[null,null,null,null,"",null,null,null,null,null,null,null,null,null,null,null,null,null,null,null,null,"TX041","No"]
[null,null,null,null,"",null,null,null,null,null,null,null,null,null,null,null,null,null,null,null,null,"TX042","No"]
[null,null,null,null,"",null,null,null,null,null,null,null,null,null,null,null,null,null,null,null,null,"TX043","No"]
[null,null,null,null,"",null,null,null,null,null,null,null,null,null,null,null,null,null,null,null,null,"TX044","No"]
[null,null,null,null,"",null,null,null,null,null,null,null,null,null,null,null,null,null,null,null,null,"TX045","No"]
[null,null,null,null,"",null,null,null,null,null,null,null,null,null,null,null,null,null,null,null,null,"TX046","No"]
[null,null,null,null,"",null,null,null,null,null,null,null,null,null,null,null,null,null,null,null,null,"TX047","No"]
[null,null,null,null,"",null,null,null,null,null,null,null,null,null,null,null,null,null,null,null,null,"TX048","No"]
[null,null,null,null,"",null,null,null,null,null,null,null,null,null,null,null,null,null,null,null,null,"TX049","No"]
[null,null,null,null,{"$f":"LEFT(F2627,2)","v":""},null,null,null,null,null,null,null,null,null,null,null,null,null,null,null,null,"TX050","No"]
[null,null,null,null,"",null,null,null,null,null,null,null,null,null,null,null,null,null,null,null,null,"TX051","No"]
[null,null,null,null,"",null,null,null,null,null,null,null,null,null,null,null,null,null,null,null,null,"TX052","No"]
[null,null,null,null,"",null,null,null,null,null,null,null,null,null,null,null,null,null,null,null,null,"TX053","No"]
[null,null,null,null,"",null,null,null,null,null,null,null,null,null,null,null,null,null,null,null,null,"TX054","No"]
[null,null,null,null,"",null,null,null,null,null,null,null,null,null,null,null,null,null,null,null,null,"TX056","No"]
[null,null,null,null,"",null,null,null,null,null,null,null,null,null,null,null,null,null,null,null,null,"TX058","No"]
[null,null,null,null,"",null,null,null,null,null,null,null,null,null,null,null,null,null,null,null,null,"TX059","No"]
[null,null,null,null,"",null,null,null,null,null,null,null,null,null,null,null,null,null,null,null,null,"TX060","No"]
[null,null,null,null,"",null,null,null,null,null,null,null,null,null,null,null,null,null,null,null,null,"TX061","No"]
[null,null,null,null,"",null,null,null,null,null,null,null,null,null,null,null,null,null,null,null,null,"TX062","No"]
[null,null,null,null,"",null,null,null,null,null,null,null,null,null,null,null,null,null,null,null,null,"TX063","No"]
[null,null,null,null,"",null,null,null,null,null,null,null,null,null,null,null,null,null,null,null,null,"TX064","No"]
[null,null,null,null,"",null,null,null,null,null,null,null,null,null,null,null,null,null,null,null,null,"TX065","No"]
[null,null,null,null,"",null,null,null,null,null,null,null,null,null,null,null,null,null,null,null,null,"TX066","No"]
[null,null,null,null,"",null,null,null,null,null,null,null,null,null,null,null,null,null,null,null,null,"TX067","No"]
[null,null,null,null,"",null,null,null,null,null,null,null,null,null,null,null,null,null,null,null,null,"TX068","No"]
[null,null,null,null,"",null,null,null,null,null,null,null,null,null,null,null,null,null,null,null,null,"TX069","No"]
[null,null,null,null,"",null,null,null,null,null,null,null,null,null,null,null,null,null,null,null,null,"TX070","No"]
[null,null,null,null,"",null,null,null,null,null,null,null,null,null,null,null,null,null,null,null,null,"TX071","No"]
[null,null,null,null,"",null,null,null,null,null,null,null,null,null,null,null,null,null,null,null,null,"TX073","No"]
[null,null,null,null,"",null,null,null,null,null,null,null,null,null,null,null,null,null,null,null,null,"TX074","No"]
[null,null,null,null,"",null,null,null,null,null,null,null,null,null,null,null,null,null,null,null,null,"TX075","No"]
[null,null,null,null,"",null,null,null,null,null,null,null,null,null,null,null,null,null,null,null,null,"TX076","No"]
[null,null,null,null,"",null,null,null,null,null,null,null,null,null,null,null,null,null,null,null,null,"TX077","No"]
[null,null,null,null,"",null,null,null,null,null,null,null,null,null,null,null,null,null,null,null,null,"TX078","No"]
[null,null,null,null,"",null,null,null,null,null,null,null,null,null,null,null,null,null,null,null,null,"TX079","No"]
[null,null,null,null,"",null,null,null,null,null,null,null,null,null,null,null,null,null,null,null,null,"TX080","No"]
[null,null,null,null,"",null,null,null,null,null,null,null,null,null,null,null,null,null,null,null,null,"TX081","No"]
[null,null,null,null,"",null,null,null,null,null,null,null,null,null,null,null,null,null,null,null,null,"TX082","No"]
[null,null,null,null,"",null,null,null,null,null,null,null,null,null,null,null,null,null,null,null,null,"TX083","No"]
[null,null,null,null,"",null,null,null,null,null,null,null,null,null,null,null,null,null,null,null,null,"TX084","No"]
[null,null,null,null,"",null,null,null,null,null,null,null,null,null,null,null,null,null,null,null,null,"TX085","No"]
[null,null,null,null,"",null,null,null,null,null,null,null,null,null,null,null,null,null,null,null,null,"TX086","No"]
[null,null,null,null,"",null,null,null,null,null,null,null,null,null,null,null,null,null,null,null,null,"TX087","No"]
[null,null,null,null,"",null,null,null,null,null,null,null,null,null,null,null,null,null,null,null,null,"TX088","No"]
[null,null,null,null,"",null,null,null,null,null,null,null,null,null,null,null,null,null,null,null,null,"TX089","No"]
[null,null,null,null,"",null,null,null,null,null,null,null,null,null,null,null,null,null,null,null,null,"TX090","No"]
[null,null,null,null,"",null,null,null,null,null,null,null,null,null,null,null,null,null,null,null,null,"TX091","No"]
[null,null,null,null,"",null,null,null,null,null,null,null,null,null,null,null,null,null,null,null,null,"TX092","No"]
[null,null,null,null,"",null,null,null,null,null,null,null,null,null,null,null,null,null,null,null,null,"TX093","No"]
[null,null,null,null,"",null,null,null,null,null,null,null,null,null,null,null,null,null,null,null,null,"TX094","No"]
[null,null,null,null,"",null,null,null,null,null,null,null,null,null,null,null,null,null,null,null,null,"TX095","No"]
[null,null,null,null,"",null,null,null,null,null,null,null,null,null,null,null,null,null,null,null,null,"TX096","No"]
[null,null,null,null,"",null,null,null,null,null,null,null,null,null,null,null,null,null,null,null,null,"TX097","No"]
[null,null,null,null,"",null,null,null,null,null,null,null,null,null,null,null,null,null,null,null,null,"TX099","No"]
[null,null,null,null,"",null,null,null,null,null,null,null,null,null,null,null,null,null,null,null,null,"TX100","No"]
[null,null,null,null,"",null,null,null,null,null,null,null,null,null,null,null,null,null,null,null,null,"TX101","No"]
[null,null,null,null,"",null,null,null,null,null,null,null,null,null,null,null,null,null,null,null,null,"TX102","No"]
[null,null,null,null,"",null,null,null,null,null,null,null,null,null,null,null,null,null,null,null,null,"TX103","No"]
[null,null,null,null,"",null,null,null,null,null,null,null,null,null,null,null,null,null,null,null,null,"TX104","No"]
[null,null,null,null,"",null,null,null,null,null,null,null,null,null,null,null,null,null,null,null,null,"TX105","No"]
[null,null,null,null,"",null,null,null,null,null,null,null,null,null,null,null,null,null,null,null,null,"TX106","No"]
[null,null,null,null,"",null,null,null,null,null,null,null,null,null,null,null,null,null,null,null,null,"TX107","No"]
[null,null,null,null,"",null,null,null,null,null,null,null,null,null,null,null,null,null,null,null,null,"TX108","No"]
[null,null,null,null,"",null,null,null,null,null,null,null,null,null,null,null,null,null,null,null,null,"TX109","No"]
[null,null,null,null,"",null,null,null,null,null,null,null,null,null,null,null,null,null,null,null,null,"TX111","No"]
[null,null,null,null,"",null,null,null,null,null,null,null,null,null,null,null,null,null,null,null,null,"TX112","No"]
[null,null,null,null,"",null,null,null,null,null,null,null,null,null,null,null,null,null,null,null,null,"TX113","No"]
[null,null,null,null,"",null,null,null,null,null,null,null,null,null,null,null,null,null,null,null,null,"TX114","No"]
[null,null,null,null,"",null,null,null,null,null,null,null,null,null,null,null,null,null,null,null,null,"TX115","No"]
[null,null,null,null,"",null,null,null,null,null,null,null,null,null,null,null,null,null,null,null,null,"TX116","No"]
[null,null,null,null,"",null,null,null,null,null,null,null,null,null,null,null,null,null,null,null,null,"TX117","No"]
[null,null,null,null,"",null,null,null,null,null,null,null,null,null,null,null,null,null,null,null,null,"TX118","No"]
[null,null,null,null,{"$f":"LEFT(F2691,2)","v":""},null,null,null,null,null,null,null,null,null,null,null,null,null,null,null,null,"TX120","No"]
[null,null,null,null,"",null,null,null,null,null,null,null,null,null,null,null,null,null,null,null,null,"TX121","No"]
[null,null,null,null,"",null,null,null,null,null,null,null,null,null,null,null,null,null,null,null,null,"TX122","No"]
[null,null,null,null,"",null,null,null,null,null,null,null,null,null,null,null,null,null,null,null,null,"TX124","No"]
[null,null,null,null,"",null,null,null,null,null,null,null,null,null,null,null,null,null,null,null,null,"TX126","No"]
[null,null,null,null,"",null,null,null,null,null,null,null,null,null,null,null,null,null,null,null,null,"TX127","No"]
[null,null,null,null,"",null,null,null,null,null,null,null,null,null,null,null,null,null,null,null,null,"TX128","No"]
[null,null,null,null,"",null,null,null,null,null,null,null,null,null,null,null,null,null,null,null,null,"TX132","No"]
[null,null,null,null,"",null,null,null,null,null,null,null,null,null,null,null,null,null,null,null,null,"TX133","No"]
[null,null,null,null,"",null,null,null,null,null,null,null,null,null,null,null,null,null,null,null,null,"TX134","No"]
[null,null,null,null,"",null,null,null,null,null,null,null,null,null,null,null,null,null,null,null,null,"TX135","No"]
[null,null,null,null,"",null,null,null,null,null,null,null,null,null,null,null,null,null,null,null,null,"TX137","No"]
[null,null,null,null,"",null,null,null,null,null,null,null,null,null,null,null,null,null,null,null,null,"TX138","No"]
[null,null,null,null,"",null,null,null,null,null,null,null,null,null,null,null,null,null,null,null,null,"TX139","No"]
[null,null,null,null,"",null,null,null,null,null,null,null,null,null,null,null,null,null,null,null,null,"TX144","No"]
[null,null,null,null,"",null,null,null,null,null,null,null,null,null,null,null,null,null,null,null,null,"TX145","No"]
[null,null,null,null,"",null,null,null,null,null,null,null,null,null,null,null,null,null,null,null,null,"TX147","No"]
[null,null,null,null,"",null,null,null,null,null,null,null,null,null,null,null,null,null,null,null,null,"TX150","No"]
[null,null,null,null,"",null,null,null,null,null,null,null,null,null,null,null,null,null,null,null,null,"TX151","No"]
[null,null,null,null,"",null,null,null,null,null,null,null,null,null,null,null,null,null,null,null,null,"TX152","No"]
[null,null,null,null,"",null,null,null,null,null,null,null,null,null,null,null,null,null,null,null,null,"TX153","No"]
[null,null,null,null,"",null,null,null,null,null,null,null,null,null,null,null,null,null,null,null,null,"TX155","No"]
[null,null,null,null,"",null,null,null,null,null,null,null,null,null,null,null,null,null,null,null,null,"TX156","No"]
[null,null,null,null,"",null,null,null,null,null,null,null,null,null,null,null,null,null,null,null,null,"TX157","No"]
[null,null,null,null,"",null,null,null,null,null,null,null,null,null,null,null,null,null,null,null,null,"TX158","No"]
[null,null,null,null,"",null,null,null,null,null,null,null,null,null,null,null,null,null,null,null,null,"TX160","No"]
[null,null,null,null,"",null,null,null,null,null,null,null,null,null,null,null,null,null,null,null,null,"TX162","No"]
[null,null,null,null,"",null,null,null,null,null,null,null,null,null,null,null,null,null,null,null,null,"TX163","No"]
[null,null,null,null,"",null,null,null,null,null,null,null,null,null,null,null,null,null,null,null,null,"TX164","No"]
[null,null,null,null,"",null,null,null,null,null,null,null,null,null,null,null,null,null,null,null,null,"TX165","No"]
[null,null,null,null,"",null,null,null,null,null,null,null,null,null,null,null,null,null,null,null,null,"TX166","No"]
[null,null,null,null,"",null,null,null,null,null,null,null,null,null,null,null,null,null,null,null,null,"TX167","No"]
[null,null,null,null,"",null,null,null,null,null,null,null,null,null,null,null,null,null,null,null,null,"TX168","No"]
[null,null,null,null,"",null,null,null,null,null,null,null,null,null,null,null,null,null,null,null,null,"TX169","No"]
[null,null,null,null,"",null,null,null,null,null,null,null,null,null,null,null,null,null,null,null,null,"TX170","No"]
[null,null,null,null,"",null,null,null,null,null,null,null,null,null,null,null,null,null,null,null,null,"TX171","No"]
[null,null,null,null,"",null,null,null,null,null,null,null,null,null,null,null,null,null,null,null,null,"TX172","No"]
[null,null,null,null,"",null,null,null,null,null,null,null,null,null,null,null,null,null,null,null,null,"TX173","No"]
[null,null,null,null,"",null,null,null,null,null,null,null,null,null,null,null,null,null,null,null,null,"TX174","No"]
[null,null,null,null,"",null,null,null,null,null,null,null,null,null,null,null,null,null,null,null,null,"TX175","No"]
[null,null,null,null,"",null,null,null,null,null,null,null,null,null,null,null,null,null,null,null,null,"TX176","No"]
[null,null,null,null,"",null,null,null,null,null,null,null,null,null,null,null,null,null,null,null,null,"TX177","No"]
[null,null,null,null,"",null,null,null,null,null,null,null,null,null,null,null,null,null,null,null,null,"TX178","No"]
[null,null,null,null,"",null,null,null,null,null,null,null,null,null,null,null,null,null,null,null,null,"TX179","No"]
[null,null,null,null,"",null,null,null,null,null,null,null,null,null,null,null,null,null,null,null,null,"TX180","No"]
[null,null,null,null,"",null,null,null,null,null,null,null,null,null,null,null,null,null,null,null,null,"TX182","No"]
[null,null,null,null,"",null,null,null,null,null,null,null,null,null,null,null,null,null,null,null,null,"TX183","No"]
[null,null,null,null,"",null,null,null,null,null,null,null,null,null,null,null,null,null,null,null,null,"TX184","No"]
[null,null,null,null,"",null,null,null,null,null,null,null,null,null,null,null,null,null,null,null,null,"TX186","No"]
[null,null,null,null,"",null,null,null,null,null,null,null,null,null,null,null,null,null,null,null,null,"TX187","No"]
[null,null,null,null,"",null,null,null,null,null,null,null,null,null,null,null,null,null,null,null,null,"TX188","No"]
[null,null,null,null,"",null,null,null,null,null,null,null,null,null,null,null,null,null,null,null,null,"TX189","No"]
[null,null,null,null,"",null,null,null,null,null,null,null,null,null,null,null,null,null,null,null,null,"TX190","No"]
[null,null,null,null,"",null,null,null,null,null,null,null,null,null,null,null,null,null,null,null,null,"TX191","No"]
[null,null,null,null,"",null,null,null,null,null,null,null,null,null,null,null,null,null,null,null,null,"TX192","No"]
[null,null,null,null,"",null,null,null,null,null,null,null,null,null,null,null,null,null,null,null,null,"TX193","No"]
[null,null,null,null,"",null,null,null,null,null,null,null,null,null,null,null,null,null,null,null,null,"TX194","No"]
[null,null,null,null,"",null,null,null,null,null,null,null,null,null,null,null,null,null,null,null,null,"TX195","No"]
[null,null,null,null,"",null,null,null,null,null,null,null,null,null,null,null,null,null,null,null,null,"TX196","No"]
[null,null,null,null,"",null,null,null,null,null,null,null,null,null,null,null,null,null,null,null,null,"TX197","No"]
[null,null,null,null,"",null,null,null,null,null,null,null,null,null,null,null,null,null,null,null,null,"TX198","No"]
[null,null,null,null,"",null,null,null,null,null,null,null,null,null,null,null,null,null,null,null,null,"TX199","No"]
[null,null,null,null,"",null,null,null,null,null,null,null,null,null,null,null,null,null,null,null,null,"TX200","No"]
[null,null,null,null,"",null,null,null,null,null,null,null,null,null,null,null,null,null,null,null,null,"TX201","No"]
[null,null,null,null,{"$f":"LEFT(F2755,2)","v":""},null,null,null,null,null,null,null,null,null,null,null,null,null,null,null,null,"TX202","No"]
[null,null,null,null,"",null,null,null,null,null,null,null,null,null,null,null,null,null,null,null,null,"TX204","No"]
[null,null,null,null,"",null,null,null,null,null,null,null,null,null,null,null,null,null,null,null,null,"TX206","No"]
[null,null,null,null,"",null,null,null,null,null,null,null,null,null,null,null,null,null,null,null,null,"TX207","No"]
[null,null,null,null,"",null,null,null,null,null,null,null,null,null,null,null,null,null,null,null,null,"TX208","No"]
[null,null,null,null,"",null,null,null,null,null,null,null,null,null,null,null,null,null,null,null,null,"TX209","No"]
[null,null,null,null,"",null,null,null,null,null,null,null,null,null,null,null,null,null,null,null,null,"TX210","No"]
[null,null,null,null,"",null,null,null,null,null,null,null,null,null,null,null,null,null,null,null,null,"TX211","No"]
[null,null,null,null,"",null,null,null,null,null,null,null,null,null,null,null,null,null,null,null,null,"TX212","No"]
[null,null,null,null,"",null,null,null,null,null,null,null,null,null,null,null,null,null,null,null,null,"TX213","No"]
[null,null,null,null,"",null,null,null,null,null,null,null,null,null,null,null,null,null,null,null,null,"TX214","No"]
[null,null,null,null,"",null,null,null,null,null,null,null,null,null,null,null,null,null,null,null,null,"TX215","No"]
[null,null,null,null,"",null,null,null,null,null,null,null,null,null,null,null,null,null,null,null,null,"TX216","No"]
[null,null,null,null,"",null,null,null,null,null,null,null,null,null,null,null,null,null,null,null,null,"TX217","No"]
[null,null,null,null,"",null,null,null,null,null,null,null,null,null,null,null,null,null,null,null,null,"TX218","No"]
[null,null,null,null,"",null,null,null,null,null,null,null,null,null,null,null,null,null,null,null,null,"TX219","No"]
[null,null,null,null,"",null,null,null,null,null,null,null,null,null,null,null,null,null,null,null,null,"TX220","No"]
[null,null,null,null,"",null,null,null,null,null,null,null,null,null,null,null,null,null,null,null,null,"TX221","No"]
[null,null,null,null,"",null,null,null,null,null,null,null,null,null,null,null,null,null,null,null,null,"TX222","No"]
[null,null,null,null,"",null,null,null,null,null,null,null,null,null,null,null,null,null,null,null,null,"TX223","No"]
[null,null,null,null,"",null,null,null,null,null,null,null,null,null,null,null,null,null,null,null,null,"TX224","No"]
[null,null,null,null,"",null,null,null,null,null,null,null,null,null,null,null,null,null,null,null,null,"TX225","No"]
[null,null,null,null,"",null,null,null,null,null,null,null,null,null,null,null,null,null,null,null,null,"TX226","No"]
[null,null,null,null,"",null,null,null,null,null,null,null,null,null,null,null,null,null,null,null,null,"TX227","No"]
[null,null,null,null,"",null,null,null,null,null,null,null,null,null,null,null,null,null,null,null,null,"TX228","No"]
[null,null,null,null,"",null,null,null,null,null,null,null,null,null,null,null,null,null,null,null,null,"TX229","No"]
[null,null,null,null,"",null,null,null,null,null,null,null,null,null,null,null,null,null,null,null,null,"TX230","No"]
[null,null,null,null,"",null,null,null,null,null,null,null,null,null,null,null,null,null,null,null,null,"TX231","No"]
[null,null,null,null,"",null,null,null,null,null,null,null,null,null,null,null,null,null,null,null,null,"TX232","No"]
[null,null,null,null,"",null,null,null,null,null,null,null,null,null,null,null,null,null,null,null,null,"TX233","No"]
[null,null,null,null,"",null,null,null,null,null,null,null,null,null,null,null,null,null,null,null,null,"TX235","No"]
[null,null,null,null,"",null,null,null,null,null,null,null,null,null,null,null,null,null,null,null,null,"TX236","No"]
[null,null,null,null,"",null,null,null,null,null,null,null,null,null,null,null,null,null,null,null,null,"TX237","No"]
[null,null,null,null,"",null,null,null,null,null,null,null,null,null,null,null,null,null,null,null,null,"TX238","No"]
[null,null,null,null,"",null,null,null,null,null,null,null,null,null,null,null,null,null,null,null,null,"TX239","No"]
[null,null,null,null,"",null,null,null,null,null,null,null,null,null,null,null,null,null,null,null,null,"TX240","No"]
[null,null,null,null,"",null,null,null,null,null,null,null,null,null,null,null,null,null,null,null,null,"TX241","No"]
[null,null,null,null,"",null,null,null,null,null,null,null,null,null,null,null,null,null,null,null,null,"TX242","No"]
[null,null,null,null,"",null,null,null,null,null,null,null,null,null,null,null,null,null,null,null,null,"TX243","No"]
[null,null,null,null,"",null,null,null,null,null,null,null,null,null,null,null,null,null,null,null,null,"TX244","No"]
[null,null,null,null,"",null,null,null,null,null,null,null,null,null,null,null,null,null,null,null,null,"TX245","No"]
[null,null,null,null,"",null,null,null,null,null,null,null,null,null,null,null,null,null,null,null,null,"TX246","No"]
[null,null,null,null,"",null,null,null,null,null,null,null,null,null,null,null,null,null,null,null,null,"TX247","No"]
[null,null,null,null,"",null,null,null,null,null,null,null,null,null,null,null,null,null,null,null,null,"TX249","No"]
[null,null,null,null,"",null,null,null,null,null,null,null,null,null,null,null,null,null,null,null,null,"TX250","No"]
[null,null,null,null,"",null,null,null,null,null,null,null,null,null,null,null,null,null,null,null,null,"TX251","No"]
[null,null,null,null,"",null,null,null,null,null,null,null,null,null,null,null,null,null,null,null,null,"TX252","No"]
[null,null,null,null,"",null,null,null,null,null,null,null,null,null,null,null,null,null,null,null,null,"TX253","No"]
[null,null,null,null,"",null,null,null,null,null,null,null,null,null,null,null,null,null,null,null,null,"TX255","No"]
[null,null,null,null,"",null,null,null,null,null,null,null,null,null,null,null,null,null,null,null,null,"TX256","No"]
[null,null,null,null,"",null,null,null,null,null,null,null,null,null,null,null,null,null,null,null,null,"TX257","No"]
[null,null,null,null,"",null,null,null,null,null,null,null,null,null,null,null,null,null,null,null,null,"TX258","No"]
[null,null,null,null,"",null,null,null,null,null,null,null,null,null,null,null,null,null,null,null,null,"TX259","No"]
[null,null,null,null,"",null,null,null,null,null,null,null,null,null,null,null,null,null,null,null,null,"TX260","No"]
[null,null,null,null,"",null,null,null,null,null,null,null,null,null,null,null,null,null,null,null,null,"TX261","No"]
[null,null,null,null,"",null,null,null,null,null,null,null,null,null,null,null,null,null,null,null,null,"TX262","No"]
[null,null,null,null,"",null,null,null,null,null,null,null,null,null,null,null,null,null,null,null,null,"TX263","No"]
[null,null,null,null,"",null,null,null,null,null,null,null,null,null,null,null,null,null,null,null,null,"TX264","No"]
[null,null,null,null,"",null,null,null,null,null,null,null,null,null,null,null,null,null,null,null,null,"TX265","No"]
[null,null,null,null,"",null,null,null,null,null,null,null,null,null,null,null,null,null,null,null,null,"TX266","No"]
[null,null,null,null,"",null,null,null,null,null,null,null,null,null,null,null,null,null,null,null,null,"TX267","No"]
[null,null,null,null,"",null,null,null,null,null,null,null,null,null,null,null,null,null,null,null,null,"TX269","No"]
[null,null,null,null,"",null,null,null,null,null,null,null,null,null,null,null,null,null,null,null,null,"TX270","No"]
[null,null,null,null,"",null,null,null,null,null,null,null,null,null,null,null,null,null,null,null,null,"TX271","No"]
[null,null,null,null,{"$f":"LEFT(F2819,2)","v":""},null,null,null,null,null,null,null,null,null,null,null,null,null,null,null,null,"TX272","No"]
[null,null,null,null,"",null,null,null,null,null,null,null,null,null,null,null,null,null,null,null,null,"TX273","No"]
[null,null,null,null,"",null,null,null,null,null,null,null,null,null,null,null,null,null,null,null,null,"TX274","No"]
[null,null,null,null,"",null,null,null,null,null,null,null,null,null,null,null,null,null,null,null,null,"TX275","No"]
[null,null,null,null,"",null,null,null,null,null,null,null,null,null,null,null,null,null,null,null,null,"TX276","No"]
[null,null,null,null,"",null,null,null,null,null,null,null,null,null,null,null,null,null,null,null,null,"TX277","No"]
[null,null,null,null,"",null,null,null,null,null,null,null,null,null,null,null,null,null,null,null,null,"TX278","No"]
[null,null,null,null,"",null,null,null,null,null,null,null,null,null,null,null,null,null,null,null,null,"TX279","No"]
[null,null,null,null,"",null,null,null,null,null,null,null,null,null,null,null,null,null,null,null,null,"TX280","No"]
[null,null,null,null,"",null,null,null,null,null,null,null,null,null,null,null,null,null,null,null,null,"TX281","No"]
[null,null,null,null,"",null,null,null,null,null,null,null,null,null,null,null,null,null,null,null,null,"TX282","No"]
[null,null,null,null,"",null,null,null,null,null,null,null,null,null,null,null,null,null,null,null,null,"TX283","No"]
[null,null,null,null,"",null,null,null,null,null,null,null,null,null,null,null,null,null,null,null,null,"TX284","No"]
[null,null,null,null,"",null,null,null,null,null,null,null,null,null,null,null,null,null,null,null,null,"TX286","No"]
[null,null,null,null,"",null,null,null,null,null,null,null,null,null,null,null,null,null,null,null,null,"TX287","No"]
[null,null,null,null,"",null,null,null,null,null,null,null,null,null,null,null,null,null,null,null,null,"TX288","No"]
[null,null,null,null,"",null,null,null,null,null,null,null,null,null,null,null,null,null,null,null,null,"TX289","No"]
[null,null,null,null,"",null,null,null,null,null,null,null,null,null,null,null,null,null,null,null,null,"TX290","No"]
[null,null,null,null,"",null,null,null,null,null,null,null,null,null,null,null,null,null,null,null,null,"TX291","No"]
[null,null,null,null,"",null,null,null,null,null,null,null,null,null,null,null,null,null,null,null,null,"TX293","No"]
[null,null,null,null,"",null,null,null,null,null,null,null,null,null,null,null,null,null,null,null,null,"TX295","No"]
[null,null,null,null,"",null,null,null,null,null,null,null,null,null,null,null,null,null,null,null,null,"TX296","No"]
[null,null,null,null,"",null,null,null,null,null,null,null,null,null,null,null,null,null,null,null,null,"TX297","No"]
[null,null,null,null,"",null,null,null,null,null,null,null,null,null,null,null,null,null,null,null,null,"TX298","No"]
[null,null,null,null,"",null,null,null,null,null,null,null,null,null,null,null,null,null,null,null,null,"TX300","No"]
[null,null,null,null,"",null,null,null,null,null,null,null,null,null,null,null,null,null,null,null,null,"TX301","No"]
[null,null,null,null,"",null,null,null,null,null,null,null,null,null,null,null,null,null,null,null,null,"TX302","No"]
[null,null,null,null,"",null,null,null,null,null,null,null,null,null,null,null,null,null,null,null,null,"TX303","No"]
[null,null,null,null,"",null,null,null,null,null,null,null,null,null,null,null,null,null,null,null,null,"TX304","No"]
[null,null,null,null,"",null,null,null,null,null,null,null,null,null,null,null,null,null,null,null,null,"TX305","No"]
[null,null,null,null,"",null,null,null,null,null,null,null,null,null,null,null,null,null,null,null,null,"TX306","No"]
[null,null,null,null,"",null,null,null,null,null,null,null,null,null,null,null,null,null,null,null,null,"TX307","No"]
[null,null,null,null,"",null,null,null,null,null,null,null,null,null,null,null,null,null,null,null,null,"TX308","No"]
[null,null,null,null,"",null,null,null,null,null,null,null,null,null,null,null,null,null,null,null,null,"TX309","No"]
[null,null,null,null,"",null,null,null,null,null,null,null,null,null,null,null,null,null,null,null,null,"TX310","No"]
[null,null,null,null,"",null,null,null,null,null,null,null,null,null,null,null,null,null,null,null,null,"TX311","No"]
[null,null,null,null,"",null,null,null,null,null,null,null,null,null,null,null,null,null,null,null,null,"TX312","No"]
[null,null,null,null,"",null,null,null,null,null,null,null,null,null,null,null,null,null,null,null,null,"TX313","No"]
[null,null,null,null,"",null,null,null,null,null,null,null,null,null,null,null,null,null,null,null,null,"TX316","No"]
[null,null,null,null,"",null,null,null,null,null,null,null,null,null,null,null,null,null,null,null,null,"TX317","No"]
[null,null,null,null,"",null,null,null,null,null,null,null,null,null,null,null,null,null,null,null,null,"TX318","No"]
[null,null,null,null,"",null,null,null,null,null,null,null,null,null,null,null,null,null,null,null,null,"TX320","No"]
[null,null,null,null,"",null,null,null,null,null,null,null,null,null,null,null,null,null,null,null,null,"TX321","No"]
[null,null,null,null,"",null,null,null,null,null,null,null,null,null,null,null,null,null,null,null,null,"TX322","No"]
[null,null,null,null,"",null,null,null,null,null,null,null,null,null,null,null,null,null,null,null,null,"TX323","No"]
[null,null,null,null,"",null,null,null,null,null,null,null,null,null,null,null,null,null,null,null,null,"TX325","No"]
[null,null,null,null,"",null,null,null,null,null,null,null,null,null,null,null,null,null,null,null,null,"TX326","No"]
[null,null,null,null,"",null,null,null,null,null,null,null,null,null,null,null,null,null,null,null,null,"TX327","No"]
[null,null,null,null,"",null,null,null,null,null,null,null,null,null,null,null,null,null,null,null,null,"TX328","No"]
[null,null,null,null,"",null,null,null,null,null,null,null,null,null,null,null,null,null,null,null,null,"TX329","No"]
[null,null,null,null,"",null,null,null,null,null,null,null,null,null,null,null,null,null,null,null,null,"TX330","No"]
[null,null,null,null,"",null,null,null,null,null,null,null,null,null,null,null,null,null,null,null,null,"TX332","No"]
[null,null,null,null,"",null,null,null,null,null,null,null,null,null,null,null,null,null,null,null,null,"TX333","No"]
[null,null,null,null,"",null,null,null,null,null,null,null,null,null,null,null,null,null,null,null,null,"TX334","No"]
[null,null,null,null,"",null,null,null,null,null,null,null,null,null,null,null,null,null,null,null,null,"TX335","No"]
[null,null,null,null,"",null,null,null,null,null,null,null,null,null,null,null,null,null,null,null,null,"TX336","No"]
[null,null,null,null,"",null,null,null,null,null,null,null,null,null,null,null,null,null,null,null,null,"TX337","No"]
[null,null,null,null,"",null,null,null,null,null,null,null,null,null,null,null,null,null,null,null,null,"TX339","No"]
[null,null,null,null,"",null,null,null,null,null,null,null,null,null,null,null,null,null,null,null,null,"TX340","No"]
[null,null,null,null,"",null,null,null,null,null,null,null,null,null,null,null,null,null,null,null,null,"TX341","No"]
[null,null,null,null,"",null,null,null,null,null,null,null,null,null,null,null,null,null,null,null,null,"TX342","No"]
[null,null,null,null,"",null,null,null,null,null,null,null,null,null,null,null,null,null,null,null,null,"TX343","No"]
[null,null,null,null,"",null,null,null,null,null,null,null,null,null,null,null,null,null,null,null,null,"TX344","No"]
[null,null,null,null,"",null,null,null,null,null,null,null,null,null,null,null,null,null,null,null,null,"TX345","No"]
[null,null,null,null,{"$f":"LEFT(F2883,2)","v":""},null,null,null,null,null,null,null,null,null,null,null,null,null,null,null,null,"TX347","No"]
[null,null,null,null,"",null,null,null,null,null,null,null,null,null,null,null,null,null,null,null,null,"TX348","No"]
[null,null,null,null,"",null,null,null,null,null,null,null,null,null,null,null,null,null,null,null,null,"TX350","No"]
[null,null,null,null,"",null,null,null,null,null,null,null,null,null,null,null,null,null,null,null,null,"TX351","No"]
[null,null,null,null,"",null,null,null,null,null,null,null,null,null,null,null,null,null,null,null,null,"TX352","No"]
[null,null,null,null,"",null,null,null,null,null,null,null,null,null,null,null,null,null,null,null,null,"TX353","No"]
[null,null,null,null,"",null,null,null,null,null,null,null,null,null,null,null,null,null,null,null,null,"TX354","No"]
[null,null,null,null,"",null,null,null,null,null,null,null,null,null,null,null,null,null,null,null,null,"TX355","No"]
[null,null,null,null,"",null,null,null,null,null,null,null,null,null,null,null,null,null,null,null,null,"TX356","No"]
[null,null,null,null,"",null,null,null,null,null,null,null,null,null,null,null,null,null,null,null,null,"TX357","No"]
[null,null,null,null,"",null,null,null,null,null,null,null,null,null,null,null,null,null,null,null,null,"TX358","No"]
[null,null,null,null,"",null,null,null,null,null,null,null,null,null,null,null,null,null,null,null,null,"TX367","No"]
[null,null,null,null,"",null,null,null,null,null,null,null,null,null,null,null,null,null,null,null,null,"TX370","No"]
[null,null,null,null,"",null,null,null,null,null,null,null,null,null,null,null,null,null,null,null,null,"TX376","No"]
[null,null,null,null,"",null,null,null,null,null,null,null,null,null,null,null,null,null,null,null,null,"TX377","No"]
[null,null,null,null,"",null,null,null,null,null,null,null,null,null,null,null,null,null,null,null,null,"TX378","No"]
[null,null,null,null,"",null,null,null,null,null,null,null,null,null,null,null,null,null,null,null,null,"TX379","No"]
[null,null,null,null,"",null,null,null,null,null,null,null,null,null,null,null,null,null,null,null,null,"TX380","No"]
[null,null,null,null,"",null,null,null,null,null,null,null,null,null,null,null,null,null,null,null,null,"TX381","No"]
[null,null,null,null,"",null,null,null,null,null,null,null,null,null,null,null,null,null,null,null,null,"TX383","No"]
[null,null,null,null,"",null,null,null,null,null,null,null,null,null,null,null,null,null,null,null,null,"TX387","No"]
[null,null,null,null,"",null,null,null,null,null,null,null,null,null,null,null,null,null,null,null,null,"TX395","No"]
[null,null,null,null,"",null,null,null,null,null,null,null,null,null,null,null,null,null,null,null,null,"TX396","No"]
[null,null,null,null,"",null,null,null,null,null,null,null,null,null,null,null,null,null,null,null,null,"TX405","No"]
[null,null,null,null,"",null,null,null,null,null,null,null,null,null,null,null,null,null,null,null,null,"TX406","No"]
[null,null,null,null,"",null,null,null,null,null,null,null,null,null,null,null,null,null,null,null,null,"TX408","No"]
[null,null,null,null,"",null,null,null,null,null,null,null,null,null,null,null,null,null,null,null,null,"TX421","No"]
[null,null,null,null,"",null,null,null,null,null,null,null,null,null,null,null,null,null,null,null,null,"TX439","No"]
[null,null,null,null,"",null,null,null,null,null,null,null,null,null,null,null,null,null,null,null,null,"TX448","No"]
[null,null,null,null,"",null,null,null,null,null,null,null,null,null,null,null,null,null,null,null,null,"TX449","No"]
[null,null,null,null,"",null,null,null,null,null,null,null,null,null,null,null,null,null,null,null,null,"TX452","No"]
[null,null,null,null,"",null,null,null,null,null,null,null,null,null,null,null,null,null,null,null,null,"TX455","No"]
[null,null,null,null,"",null,null,null,null,null,null,null,null,null,null,null,null,null,null,null,null,"TX457","No"]
[null,null,null,null,"",null,null,null,null,null,null,null,null,null,null,null,null,null,null,null,null,"TX469","No"]
[null,null,null,null,"",null,null,null,null,null,null,null,null,null,null,null,null,null,null,null,null,"TX470","No"]
[null,null,null,null,"",null,null,null,null,null,null,null,null,null,null,null,null,null,null,null,null,"TX480","No"]
[null,null,null,null,"",null,null,null,null,null,null,null,null,null,null,null,null,null,null,null,null,"TX486","No"]
[null,null,null,null,"",null,null,null,null,null,null,null,null,null,null,null,null,null,null,null,null,"TX492","No"]
[null,null,null,null,"",null,null,null,null,null,null,null,null,null,null,null,null,null,null,null,null,"TX497","No"]
[null,null,null,null,"",null,null,null,null,null,null,null,null,null,null,null,null,null,null,null,null,"TX509","No"]
[null,null,null,null,"",null,null,null,null,null,null,null,null,null,null,null,null,null,null,null,null,"TX510","No"]
[null,null,null,null,"",null,null,null,null,null,null,null,null,null,null,null,null,null,null,null,null,"TX525","No"]
[null,null,null,null,"",null,null,null,null,null,null,null,null,null,null,null,null,null,null,null,null,"TX531","No"]
[null,null,null,null,"",null,null,null,null,null,null,null,null,null,null,null,null,null,null,null,null,"TX538","No"]
[null,null,null,null,"",null,null,null,null,null,null,null,null,null,null,null,null,null,null,null,null,"TX539","No"]
[null,null,null,null,"",null,null,null,null,null,null,null,null,null,null,null,null,null,null,null,null,"TX543","No"]
[null,null,null,null,"",null,null,null,null,null,null,null,null,null,null,null,null,null,null,null,null,"TX546","No"]
[null,null,null,null,"",null,null,null,null,null,null,null,null,null,null,null,null,null,null,null,null,"TX549","No"]
[null,null,null,null,"",null,null,null,null,null,null,null,null,null,null,null,null,null,null,null,null,"TX550","No"]
[null,null,null,null,"",null,null,null,null,null,null,null,null,null,null,null,null,null,null,null,null,"TX552","No"]
[null,null,null,null,"",null,null,null,null,null,null,null,null,null,null,null,null,null,null,null,null,"UT002","No"]
[null,null,null,null,"",null,null,null,null,null,null,null,null,null,null,null,null,null,null,null,null,"UT003","No"]
[null,null,null,null,"",null,null,null,null,null,null,null,null,null,null,null,null,null,null,null,null,"UT004","No"]
[null,null,null,null,"",null,null,null,null,null,null,null,null,null,null,null,null,null,null,null,null,"UT006","No"]
[null,null,null,null,"",null,null,null,null,null,null,null,null,null,null,null,null,null,null,null,null,"UT007","No"]
[null,null,null,null,"",null,null,null,null,null,null,null,null,null,null,null,null,null,null,null,null,"UT009","No"]
[null,null,null,null,"",null,null,null,null,null,null,null,null,null,null,null,null,null,null,null,null,"UT011","No"]
[null,null,null,null,"",null,null,null,null,null,null,null,null,null,null,null,null,null,null,null,null,"UT015","No"]
[null,null,null,null,"",null,null,null,null,null,null,null,null,null,null,null,null,null,null,null,null,"UT016","No"]
[null,null,null,null,"",null,null,null,null,null,null,null,null,null,null,null,null,null,null,null,null,"UT020","No"]
[null,null,null,null,"",null,null,null,null,null,null,null,null,null,null,null,null,null,null,null,null,"UT021","No"]
[null,null,null,null,"",null,null,null,null,null,null,null,null,null,null,null,null,null,null,null,null,"UT025","Yes"]
[null,null,null,null,"",null,null,null,null,null,null,null,null,null,null,null,null,null,null,null,null,"VA001","Yes"]
[null,null,null,null,"",null,null,null,null,null,null,null,null,null,null,null,null,null,null,null,null,"VA002","Yes"]
[null,null,null,null,{"$f":"LEFT(F2947,2)","v":""},null,null,null,null,null,null,null,null,null,null,null,null,null,null,null,null,"VA003","No"]
[null,null,null,null,"",null,null,null,null,null,null,null,null,null,null,null,null,null,null,null,null,"VA004","Yes"]
[null,null,null,null,"",null,null,null,null,null,null,null,null,null,null,null,null,null,null,null,null,"VA005","Yes"]
[null,null,null,null,"",null,null,null,null,null,null,null,null,null,null,null,null,null,null,null,null,"VA006","No"]
[null,null,null,null,"",null,null,null,null,null,null,null,null,null,null,null,null,null,null,null,null,"VA007","No"]
[null,null,null,null,"",null,null,null,null,null,null,null,null,null,null,null,null,null,null,null,null,"VA010","No"]
[null,null,null,null,"",null,null,null,null,null,null,null,null,null,null,null,null,null,null,null,null,"VA011","No"]
[null,null,null,null,"",null,null,null,null,null,null,null,null,null,null,null,null,null,null,null,null,"VA012","No"]
[null,null,null,null,"",null,null,null,null,null,null,null,null,null,null,null,null,null,null,null,null,"VA013","Yes"]
[null,null,null,null,"",null,null,null,null,null,null,null,null,null,null,null,null,null,null,null,null,"VA014","No"]
[null,null,null,null,"",null,null,null,null,null,null,null,null,null,null,null,null,null,null,null,null,"VA015","Yes"]
[null,null,null,null,"",null,null,null,null,null,null,null,null,null,null,null,null,null,null,null,null,"VA016","No"]
[null,null,null,null,"",null,null,null,null,null,null,null,null,null,null,null,null,null,null,null,null,"VA017","No"]
[null,null,null,null,"",null,null,null,null,null,null,null,null,null,null,null,null,null,null,null,null,"VA018","No"]
[null,null,null,null,"",null,null,null,null,null,null,null,null,null,null,null,null,null,null,null,null,"VA019","Yes"]
[null,null,null,null,"",null,null,null,null,null,null,null,null,null,null,null,null,null,null,null,null,"VA020","No"]
[null,null,null,null,"",null,null,null,null,null,null,null,null,null,null,null,null,null,null,null,null,"VA021","No"]
[null,null,null,null,"",null,null,null,null,null,null,null,null,null,null,null,null,null,null,null,null,"VA022","Yes"]
[null,null,null,null,"",null,null,null,null,null,null,null,null,null,null,null,null,null,null,null,null,"VA023","No"]
[null,null,null,null,"",null,null,null,null,null,null,null,null,null,null,null,null,null,null,null,null,"VA024","No"]
[null,null,null,null,"",null,null,null,null,null,null,null,null,null,null,null,null,null,null,null,null,"VA025","Yes"]
[null,null,null,null,"",null,null,null,null,null,null,null,null,null,null,null,null,null,null,null,null,"VA026","Yes"]
[null,null,null,null,"",null,null,null,null,null,null,null,null,null,null,null,null,null,null,null,null,"VA029","Yes"]
[null,null,null,null,"",null,null,null,null,null,null,null,null,null,null,null,null,null,null,null,null,"VA030","No"]
[null,null,null,null,"",null,null,null,null,null,null,null,null,null,null,null,null,null,null,null,null,"VA031","Yes"]
[null,null,null,null,"",null,null,null,null,null,null,null,null,null,null,null,null,null,null,null,null,"VA032","No"]
[null,null,null,null,"",null,null,null,null,null,null,null,null,null,null,null,null,null,null,null,null,"VA034","No"]
[null,null,null,null,"",null,null,null,null,null,null,null,null,null,null,null,null,null,null,null,null,"VQ001","No"]
[null,null,null,null,"",null,null,null,null,null,null,null,null,null,null,null,null,null,null,null,null,"VT001","No"]
[null,null,null,null,"",null,null,null,null,null,null,null,null,null,null,null,null,null,null,null,null,"VT002","No"]
[null,null,null,null,"",null,null,null,null,null,null,null,null,null,null,null,null,null,null,null,null,"VT003","Yes"]
[null,null,null,null,"",null,null,null,null,null,null,null,null,null,null,null,null,null,null,null,null,"VT004","No"]
[null,null,null,null,"",null,null,null,null,null,null,null,null,null,null,null,null,null,null,null,null,"VT005","No"]
[null,null,null,null,"",null,null,null,null,null,null,null,null,null,null,null,null,null,null,null,null,"VT006","No"]
[null,null,null,null,"",null,null,null,null,null,null,null,null,null,null,null,null,null,null,null,null,"VT008","Yes"]
[null,null,null,null,"",null,null,null,null,null,null,null,null,null,null,null,null,null,null,null,null,"VT009","Yes"]
[null,null,null,null,"",null,null,null,null,null,null,null,null,null,null,null,null,null,null,null,null,"WA001","No"]
[null,null,null,null,"",null,null,null,null,null,null,null,null,null,null,null,null,null,null,null,null,"WA002","No"]
[null,null,null,null,"",null,null,null,null,null,null,null,null,null,null,null,null,null,null,null,null,"WA003","Yes"]
[null,null,null,null,"",null,null,null,null,null,null,null,null,null,null,null,null,null,null,null,null,"WA004","Yes"]
[null,null,null,null,"",null,null,null,null,null,null,null,null,null,null,null,null,null,null,null,null,"WA005","No"]
[null,null,null,null,"",null,null,null,null,null,null,null,null,null,null,null,null,null,null,null,null,"WA006","No"]
[null,null,null,null,"",null,null,null,null,null,null,null,null,null,null,null,null,null,null,null,null,"WA008","No"]
[null,null,null,null,"",null,null,null,null,null,null,null,null,null,null,null,null,null,null,null,null,"WA009","No"]
[null,null,null,null,"",null,null,null,null,null,null,null,null,null,null,null,null,null,null,null,null,"WA010","No"]
[null,null,null,null,"",null,null,null,null,null,null,null,null,null,null,null,null,null,null,null,null,"WA011","No"]
[null,null,null,null,"",null,null,null,null,null,null,null,null,null,null,null,null,null,null,null,null,"WA012","No"]
[null,null,null,null,"",null,null,null,null,null,null,null,null,null,null,null,null,null,null,null,null,"WA014","No"]
[null,null,null,null,"",null,null,null,null,null,null,null,null,null,null,null,null,null,null,null,null,"WA017","No"]
[null,null,null,null,"",null,null,null,null,null,null,null,null,null,null,null,null,null,null,null,null,"WA018","No"]
[null,null,null,null,"",null,null,null,null,null,null,null,null,null,null,null,null,null,null,null,null,"WA019","No"]
[null,null,null,null,"",null,null,null,null,null,null,null,null,null,null,null,null,null,null,null,null,"WA020","No"]
[null,null,null,null,"",null,null,null,null,null,null,null,null,null,null,null,null,null,null,null,null,"WA021","No"]
[null,null,null,null,"",null,null,null,null,null,null,null,null,null,null,null,null,null,null,null,null,"WA024","No"]
[null,null,null,null,"",null,null,null,null,null,null,null,null,null,null,null,null,null,null,null,null,"WA025","No"]
[null,null,null,null,"",null,null,null,null,null,null,null,null,null,null,null,null,null,null,null,null,"WA026","No"]
[null,null,null,null,"",null,null,null,null,null,null,null,null,null,null,null,null,null,null,null,null,"WA030","No"]
[null,null,null,null,"",null,null,null,null,null,null,null,null,null,null,null,null,null,null,null,null,"WA035","No"]
[null,null,null,null,"",null,null,null,null,null,null,null,null,null,null,null,null,null,null,null,null,"WA036","No"]
[null,null,null,null,"",null,null,null,null,null,null,null,null,null,null,null,null,null,null,null,null,"WA039","No"]
[null,null,null,null,"",null,null,null,null,null,null,null,null,null,null,null,null,null,null,null,null,"WA041","No"]
[null,null,null,null,"",null,null,null,null,null,null,null,null,null,null,null,null,null,null,null,null,"WA042","No"]
[null,null,null,null,"",null,null,null,null,null,null,null,null,null,null,null,null,null,null,null,null,"WA054","No"]
[null,null,null,null,"",null,null,null,null,null,null,null,null,null,null,null,null,null,null,null,null,"WA055","No"]
[null,null,null,null,{"$f":"LEFT(F3011,2)","v":""},null,null,null,null,null,null,null,null,null,null,null,null,null,null,null,null,"WA057","Yes"]
[null,null,null,null,"",null,null,null,null,null,null,null,null,null,null,null,null,null,null,null,null,"WI001","Yes"]
[null,null,null,null,"",null,null,null,null,null,null,null,null,null,null,null,null,null,null,null,null,"WI002","No"]
[null,null,null,null,"",null,null,null,null,null,null,null,null,null,null,null,null,null,null,null,null,"WI003","No"]
[null,null,null,null,"",null,null,null,null,null,null,null,null,null,null,null,null,null,null,null,null,"WI004","No"]
[null,null,null,null,"",null,null,null,null,null,null,null,null,null,null,null,null,null,null,null,null,"WI006","No"]
[null,null,null,null,"",null,null,null,null,null,null,null,null,null,null,null,null,null,null,null,null,"WI008","No"]
[null,null,null,null,"",null,null,null,null,null,null,null,null,null,null,null,null,null,null,null,null,"WI011","No"]
[null,null,null,null,"",null,null,null,null,null,null,null,null,null,null,null,null,null,null,null,null,"WI015","No"]
[null,null,null,null,"",null,null,null,null,null,null,null,null,null,null,null,null,null,null,null,null,"WI016","No"]
[null,null,null,null,"",null,null,null,null,null,null,null,null,null,null,null,null,null,null,null,null,"WI017","No"]
[null,null,null,null,"",null,null,null,null,null,null,null,null,null,null,null,null,null,null,null,null,"WI018","No"]
[null,null,null,null,"",null,null,null,null,null,null,null,null,null,null,null,null,null,null,null,null,"WI019","No"]
[null,null,null,null,"",null,null,null,null,null,null,null,null,null,null,null,null,null,null,null,null,"WI020","No"]
[null,null,null,null,"",null,null,null,null,null,null,null,null,null,null,null,null,null,null,null,null,"WI021","No"]
[null,null,null,null,"",null,null,null,null,null,null,null,null,null,null,null,null,null,null,null,null,"WI023","No"]
[null,null,null,null,"",null,null,null,null,null,null,null,null,null,null,null,null,null,null,null,null,"WI024","No"]
[null,null,null,null,"",null,null,null,null,null,null,null,null,null,null,null,null,null,null,null,null,"WI025","No"]
[null,null,null,null,"",null,null,null,null,null,null,null,null,null,null,null,null,null,null,null,null,"WI026","No"]
[null,null,null,null,"",null,null,null,null,null,null,null,null,null,null,null,null,null,null,null,null,"WI028","No"]
[null,null,null,null,"",null,null,null,null,null,null,null,null,null,null,null,null,null,null,null,null,"WI029","No"]
[null,null,null,null,"",null,null,null,null,null,null,null,null,null,null,null,null,null,null,null,null,"WI030","No"]
[null,null,null,null,"",null,null,null,null,null,null,null,null,null,null,null,null,null,null,null,null,"WI031","No"]
[null,null,null,null,"",null,null,null,null,null,null,null,null,null,null,null,null,null,null,null,null,"WI032","No"]
[null,null,null,null,"",null,null,null,null,null,null,null,null,null,null,null,null,null,null,null,null,"WI033","No"]
[null,null,null,null,"",null,null,null,null,null,null,null,null,null,null,null,null,null,null,null,null,"WI034","No"]
[null,null,null,null,"",null,null,null,null,null,null,null,null,null,null,null,null,null,null,null,null,"WI037","No"]
[null,null,null,null,"",null,null,null,null,null,null,null,null,null,null,null,null,null,null,null,null,"WI038","No"]
[null,null,null,null,"",null,null,null,null,null,null,null,null,null,null,null,null,null,null,null,null,"WI040","No"]
[null,null,null,null,"",null,null,null,null,null,null,null,null,null,null,null,null,null,null,null,null,"WI041","No"]
[null,null,null,null,"",null,null,null,null,null,null,null,null,null,null,null,null,null,null,null,null,"WI042","No"]
[null,null,null,null,"",null,null,null,null,null,null,null,null,null,null,null,null,null,null,null,null,"WI043","No"]
[null,null,null,null,"",null,null,null,null,null,null,null,null,null,null,null,null,null,null,null,null,"WI044","No"]
[null,null,null,null,"",null,null,null,null,null,null,null,null,null,null,null,null,null,null,null,null,"WI045","No"]
[null,null,null,null,"",null,null,null,null,null,null,null,null,null,null,null,null,null,null,null,null,"WI046","No"]
[null,null,null,null,"",null,null,null,null,null,null,null,null,null,null,null,null,null,null,null,null,"WI047","No"]
[null,null,null,null,"",null,null,null,null,null,null,null,null,null,null,null,null,null,null,null,null,"WI048","No"]
[null,null,null,null,"",null,null,null,null,null,null,null,null,null,null,null,null,null,null,null,null,"WI049","No"]
[null,null,null,null,"",null,null,null,null,null,null,null,null,null,null,null,null,null,null,null,null,"WI050","No"]
[null,null,null,null,"",null,null,null,null,null,null,null,null,null,null,null,null,null,null,null,null,"WI051","No"]
[null,null,null,null,"",null,null,null,null,null,null,null,null,null,null,null,null,null,null,null,null,"WI052","No"]
[null,null,null,null,"",null,null,null,null,null,null,null,null,null,null,null,null,null,null,null,null,"WI055","No"]
[null,null,null,null,"",null,null,null,null,null,null,null,null,null,null,null,null,null,null,null,null,"WI056","No"]
[null,null,null,null,"",null,null,null,null,null,null,null,null,null,null,null,null,null,null,null,null,"WI057","No"]
[null,null,null,null,"",null,null,null,null,null,null,null,null,null,null,null,null,null,null,null,null,"WI058","No"]
[null,null,null,null,"",null,null,null,null,null,null,null,null,null,null,null,null,null,null,null,null,"WI059","No"]
[null,null,null,null,"",null,null,null,null,null,null,null,null,null,null,null,null,null,null,null,null,"WI060","No"]
[null,null,null,null,"",null,null,null,null,null,null,null,null,null,null,null,null,null,null,null,null,"WI061","No"]
[null,null,null,null,"",null,null,null,null,null,null,null,null,null,null,null,null,null,null,null,null,"WI063","Yes"]
[null,null,null,null,"",null,null,null,null,null,null,null,null,null,null,null,null,null,null,null,null,"WI064","No"]
[null,null,null,null,"",null,null,null,null,null,null,null,null,null,null,null,null,null,null,null,null,"WI065","No"]
[null,null,null,null,"",null,null,null,null,null,null,null,null,null,null,null,null,null,null,null,null,"WI066","No"]
[null,null,null,null,"",null,null,null,null,null,null,null,null,null,null,null,null,null,null,null,null,"WI067","No"]
[null,null,null,null,"",null,null,null,null,null,null,null,null,null,null,null,null,null,null,null,null,"WI068","No"]
[null,null,null,null,"",null,null,null,null,null,null,null,null,null,null,null,null,null,null,null,null,"WI069","No"]
[null,null,null,null,"",null,null,null,null,null,null,null,null,null,null,null,null,null,null,null,null,"WI070","No"]
[null,null,null,null,"",null,null,null,null,null,null,null,null,null,null,null,null,null,null,null,null,"WI071","No"]
[null,null,null,null,"",null,null,null,null,null,null,null,null,null,null,null,null,null,null,null,null,"WI072","No"]
[null,null,null,null,"",null,null,null,null,null,null,null,null,null,null,null,null,null,null,null,null,"WI073","No"]
[null,null,null,null,"",null,null,null,null,null,null,null,null,null,null,null,null,null,null,null,null,"WI074","No"]
[null,null,null,null,{"$f":"LEFT(F3071,2)","v":""},null,null,null,null,null,null,null,null,null,null,null,null,null,null,null,null,"WI075","No"]
[null,null,null,null,"",null,null,null,null,null,null,null,null,null,null,null,null,null,null,null,null,"WI076","No"]
[null,null,null,null,"",null,null,null,null,null,null,null,null,null,null,null,null,null,null,null,null,"WI077","No"]
[null,null,null,null,"",null,null,null,null,null,null,null,null,null,null,null,null,null,null,null,null,"WI083","No"]
[null,null,null,null,{"$f":"LEFT(F3075,2)","v":""},null,null,null,null,null,null,null,null,null,null,null,null,null,null,null,null,"WI085","No"]
[null,null,null,null,"",null,null,null,null,null,null,null,null,null,null,null,null,null,null,null,null,"WI086","No"]
[null,null,null,null,"",null,null,null,null,null,null,null,null,null,null,null,null,null,null,null,null,"WI090","No"]
[null,null,null,null,"",null,null,null,null,null,null,null,null,null,null,null,null,null,null,null,null,"WI093","No"]
[null,null,null,null,"",null,null,null,null,null,null,null,null,null,null,null,null,null,null,null,null,"WI096","No"]
[null,null,null,null,"",null,null,null,null,null,null,null,null,null,null,null,null,null,null,null,null,"WI098","No"]
[null,null,null,null,"",null,null,null,null,null,null,null,null,null,null,null,null,null,null,null,null,"WI102","Yes"]
[null,null,null,null,"",null,null,null,null,null,null,null,null,null,null,null,null,null,null,null,null,"WI111","No"]
[null,null,null,null,"",null,null,null,null,null,null,null,null,null,null,null,null,null,null,null,null,"WI113","No"]
[null,null,null,null,"",null,null,null,null,null,null,null,null,null,null,null,null,null,null,null,null,"WI117","No"]
[null,null,null,null,"",null,null,null,null,null,null,null,null,null,null,null,null,null,null,null,null,"WI118","No"]
[null,null,null,null,"",null,null,null,null,null,null,null,null,null,null,null,null,null,null,null,null,"WI127","No"]
[null,null,null,null,"",null,null,null,null,null,null,null,null,null,null,null,null,null,null,null,null,"WI129","No"]
[null,null,null,null,"",null,null,null,null,null,null,null,null,null,null,null,null,null,null,null,null,"WI131","No"]
[null,null,null,null,"",null,null,null,null,null,null,null,null,null,null,null,null,null,null,null,null,"WI139","No"]
[null,null,null,null,"",null,null,null,null,null,null,null,null,null,null,null,null,null,null,null,null,"WI142","No"]
[null,null,null,null,"",null,null,null,null,null,null,null,null,null,null,null,null,null,null,null,null,"WI158","No"]
[null,null,null,null,"",null,null,null,null,null,null,null,null,null,null,null,null,null,null,null,null,"WI166","No"]
[null,null,null,null,"",null,null,null,null,null,null,null,null,null,null,null,null,null,null,null,null,"WI183","No"]
[null,null,null,null,"",null,null,null,null,null,null,null,null,null,null,null,null,null,null,null,null,"WI193","No"]
[null,null,null,null,"",null,null,null,null,null,null,null,null,null,null,null,null,null,null,null,null,"WI204","No"]
[null,null,null,null,{"$f":"LEFT(F3096,2)","v":""},null,null,null,null,null,null,null,null,null,null,null,null,null,null,null,null,"WI207","No"]
[null,null,null,null,{"$f":"LEFT(F3097,2)","v":""},null,null,null,null,null,null,null,null,null,null,null,null,null,null,null,null,"WI213","No"]
[null,null,null,null,"",null,null,null,null,null,null,null,null,null,null,null,null,null,null,null,null,"WI214","No"]
[null,null,null,null,"",null,null,null,null,null,null,null,null,null,null,null,null,null,null,null,null,"WI221","No"]
[null,null,null,null,"",null,null,null,null,null,null,null,null,null,null,null,null,null,null,null,null,"WI226","No"]
[null,null,null,null,"",null,null,null,null,null,null,null,null,null,null,null,null,null,null,null,null,"WI231","No"]
[null,null,null,null,"",null,null,null,null,null,null,null,null,null,null,null,null,null,null,null,null,"WI242","No"]
[null,null,null,null,"",null,null,null,null,null,null,null,null,null,null,null,null,null,null,null,null,"WI246","No"]
[null,null,null,null,"",null,null,null,null,null,null,null,null,null,null,null,null,null,null,null,null,"WI247","No"]
[null,null,null,null,"",null,null,null,null,null,null,null,null,null,null,null,null,null,null,null,null,"WI249","No"]
[null,null,null,null,"",null,null,null,null,null,null,null,null,null,null,null,null,null,null,null,null,"WI251","Yes"]
[null,null,null,null,{"$f":"LEFT(F3107,2)","v":""},null,null,null,null,null,null,null,null,null,null,null,null,null,null,null,null,"WI253","No"]
[null,null,null,null,{"$f":"LEFT(F3108,2)","v":""},null,null,null,null,null,null,null,null,null,null,null,null,null,null,null,null,"WV001","Yes"]
[null,null,null,null,"",null,null,null,null,null,null,null,null,null,null,null,null,null,null,null,null,"WV003","No"]
[null,null,null,null,null,null,null,null,null,null,null,null,null,null,null,null,null,null,null,null,null,"WV004","No"]
[null,null,null,null,null,null,null,null,null,null,null,null,null,null,null,null,null,null,null,null,null,"WV005","No"]
[null,null,null,null,null,null,null,null,null,null,null,null,null,null,null,null,null,null,null,null,null,"WV006","No"]
[null,null,null,null,null,null,null,null,null,null,null,null,null,null,null,null,null,null,null,null,null,"WV007","No"]
[null,null,null,null,null,null,null,null,null,null,null,null,null,null,null,null,null,null,null,null,null,"WV008","No"]
[null,null,null,null,null,null,null,null,null,null,null,null,null,null,null,null,null,null,null,null,null,"WV009","No"]
[null,null,null,null,null,null,null,null,null,null,null,null,null,null,null,null,null,null,null,null,null,"WV010","No"]
[null,null,null,null,null,null,null,null,null,null,null,null,null,null,null,null,null,null,null,null,null,"WV011","No"]
[null,null,null,null,null,null,null,null,null,null,null,null,null,null,null,null,null,null,null,null,null,"WV012","No"]
[null,null,null,null,null,null,null,null,null,null,null,null,null,null,null,null,null,null,null,null,null,"WV013","No"]
[null,null,null,null,null,null,null,null,null,null,null,null,null,null,null,null,null,null,null,null,null,"WV014","No"]
[null,null,null,null,null,null,null,null,null,null,null,null,null,null,null,null,null,null,null,null,null,"WV015","No"]
[null,null,null,null,null,null,null,null,null,null,null,null,null,null,null,null,null,null,null,null,null,"WV016","No"]
[null,null,null,null,null,null,null,null,null,null,null,null,null,null,null,null,null,null,null,null,null,"WV017","No"]
[null,null,null,null,null,null,null,null,null,null,null,null,null,null,null,null,null,null,null,null,null,"WV018","No"]
[null,null,null,null,null,null,null,null,null,null,null,null,null,null,null,null,null,null,null,null,null,"WV020","No"]
[null,null,null,null,null,null,null,null,null,null,null,null,null,null,null,null,null,null,null,null,null,"WV021","No"]
[null,null,null,null,null,null,null,null,null,null,null,null,null,null,null,null,null,null,null,null,null,"WV022","No"]
[null,null,null,null,null,null,null,null,null,null,null,null,null,null,null,null,null,null,null,null,null,"WV024","No"]
[null,null,null,null,null,null,null,null,null,null,null,null,null,null,null,null,null,null,null,null,null,"WV026","No"]
[null,null,null,null,null,null,null,null,null,null,null,null,null,null,null,null,null,null,null,null,null,"WV027","No"]
[null,null,null,null,null,null,null,null,null,null,null,null,null,null,null,null,null,null,null,null,null,"WV028","No"]
[null,null,null,null,null,null,null,null,null,null,null,null,null,null,null,null,null,null,null,null,null,"WV029","No"]
[null,null,null,null,null,null,null,null,null,null,null,null,null,null,null,null,null,null,null,null,null,"WV035","No"]
[null,null,null,null,null,null,null,null,null,null,null,null,null,null,null,null,null,null,null,null,null,"WV036","No"]
[null,null,null,null,null,null,null,null,null,null,null,null,null,null,null,null,null,null,null,null,null,"WV037","No"]
[null,null,null,null,null,null,null,null,null,null,null,null,null,null,null,null,null,null,null,null,null,"WV039","No"]
[null,null,null,null,null,null,null,null,null,null,null,null,null,null,null,null,null,null,null,null,null,"WV042","No"]
[null,null,null,null,null,null,null,null,null,null,null,null,null,null,null,null,null,null,null,null,null,"WV044","No"]
[null,null,null,null,null,null,null,null,null,null,null,null,null,null,null,null,null,null,null,null,null,"WY002","No"]
[null,null,null,null,null,null,null,null,null,null,null,null,null,null,null,null,null,null,null,null,null,"WY003","No"]
[null,null,null,null,null,null,null,null,null,null,null,null,null,null,null,null,null,null,null,null,null,"WY004","No"]
[null,null,null,null,null,null,null,null,null,null,null,null,null,null,null,null,null,null,null,null,null,"WY005","No"]
[null,null,null,null,null,null,null,null,null,null,null,null,null,null,null,null,null,null,null,null,null,"WY008","No"]
[null,null,null,null,null,null,null,null,null,null,null,null,null,null,null,null,null,null,null,null,null,"WY010","No"]

{"sheet":"UEL Header Prepop","index":7,"n_rows":50,"n_cols":21,"rows_kept":50,"cut":false,"hidden":false,"merged":[]}
["PPN","HAName","ACC","DUNS","ROFO","FYE","UnitChangeInd","RRIYN","StudyYear","BaseUtilityExpenseLevel","UtilitySurcharges","BaseMinusSurcharge","UtiliyInflationDeflationFactor","UELAdjustedForInflation","EnergyRateIncentive","UEL","EligibleUnitMonths","FinalUEL","addr1","addr2","comments"]
["Please Select PPN",null,null,null,null,null,false,false]
["@AL005000018","Phoenix City HA","A-3799","052630282","0409","2013-09-30","FALSE","FALSE","7/1/2013-6/30/2014","","","",1.0563,"","","","","","PO Box 338","Phenix City, AL 36868",""]
["@AL190000004","Housing Authority of Greene County, Al","A2129","627191398","0409","2013-12-31","FALSE","FALSE","7/1/2013-6/30/2014","","","",1.0563,"","","","","","Post Office Box 389","Eutaw, AL 35462",""]
["@FL003000043","Tampa Housing Authority","A-4325","025637356","0414","2014-03-31","FALSE","FALSE","7/1/2013-6/30/2014","","","",1.0563,"","","","","","1529 W Main Street","Tampa, FL 33607",""]
["@FL005000848","Miami Dade Housing","A-4252","136721177","0414","2014-09-30","FALSE","FALSE","7/1/2013-6/30/2014","","","",1.0563,"","","","","","701 NW 1st Court","Miami, FL 33136",""]
["@FL005000849","Miami Dade Housing","A-4252","136721177","0414","2014-09-30","FALSE","FALSE","7/1/2013-6/30/2014","","","",1.0563,"","","","","","701 NW 1st Court","Miami, FL 33136",""]
["@FL005000850","Miami Dade Housing","A-4252","136721177","0414","2014-09-30","FALSE","FALSE","7/1/2013-6/30/2014","","","",1.0563,"","","","","","701 NW 1st Court","Miami, FL 33136",""]
["@FL005000851","Miami Dade Housing","A-4252","136721177","0414","2014-09-30","FALSE","FALSE","7/1/2013-6/30/2014","","","",1.0563,"","","","","","701 NW 1st Court","Miami, FL 33136",""]
["@FL005000852","Miami Dade Housing","A-4252","136721177","0414","2014-09-30","FALSE","FALSE","7/1/2013-6/30/2014","","","",1.0563,"","","","","","701 NW 1st Court","Miami, FL 33136",""]
["@FL021000004","Pahokee Housing Authority","A-2987","964864854","0414","2013-06-30","FALSE","FALSE","7/1/2013-6/30/2014","","","",1.0563,"","","","","","465 Friend Terrace","Pahokee, FL 33476",""]
["@FL062000011","Pinellas County Housing Authority","A-4218","787400886","0414","2014-12-31","FALSE","FALSE","7/1/2013-6/30/2014","","","",1.0563,"","","","","","11479 Ulmerton Road","Largo, FL 33778",""]
["@IN003000008","Fort Wayne ","C-981","187667290","0536","2013-06-30","FALSE","FALSE","7/1/2013-6/30/2014","","","",1.0563,"","","","","","PO Box 13489","Fort Wayne, IN 46869",""]
["@LA004000006","Housing Authority of Lake Charles","FW-1132","042360458","0648","2013-09-30","FALSE","FALSE","7/1/2013-6/30/2014","","","",1.0563,"","","","","","PO Box 1206","Lake Charles, LA 70602",""]
["@MI001000081","Detroit Housing Commission","118271910","830516790","0528","2013-06-30","FALSE","FALSE","7/1/2013-6/30/2014","","","",1.0563,"","","","","","1301 E 1301 E. Jefferson Avenue","Detroit, MI 48207",""]
["@MN003000014","HRA of Duluth","C-949","010351005","0546","2013-09-30","FALSE","FALSE","7/1/2013-6/30/2014","","","",1.0563,"","","","","","222 East Second Street PO Box 16900","Duluth, MN 55816",""]
["@MO009000002","City of Jefferson City","KC5291","182974196","0736","2013-03-31","FALSE","FALSE","7/1/2013-6/30/2014","","","",1.0563,"","","","","","PO Box 1029","Jefferson City, MO 65102",""]
["@MS004000021","Meridian HA","A-2504","107978124","0426","2013-03-31","FALSE","FALSE","7/1/2013-6/30/2014","","","",1.0563,"","","","","","PO Box 870","Meridian, MS 39302",""]
["@MS103000003","Jackson Housing Authority","A-3531","176865785","0426","2013-06-30","FALSE","FALSE","7/1/2013-6/30/2014","","","",1.0563,"","","","","","PO Box 11327","Jackson, MS 39283",""]
["@NC003000063","Charlotte HA","A-4156","074523176","0419","2013-03-31","FALSE","FALSE","7/1/2013-6/30/2014","","","",1.0563,"","","","","","PO Box 36795","Charlotte, NC 28236",""]
["@NC003000064","Charlotte","A-4156","074523176","0419","2013-03-31","FALSE","FALSE","7/1/2013-6/30/2014","","","",1.0563,"","","","","","PO Box 36795","Charlotte, NC 28236",""]
["@NC003000065","Charlotte","A-4156","074523176","0419","2013-03-31","FALSE","FALSE","7/1/2013-6/30/2014","","","",1.0563,"","","","","","PO Box 36795","Charlotte, NC 28236",""]
["@NC009000024","Fayetteville Metropolitan Housing Authority","A-4052","097599963","0419","2013-09-30","FALSE","FALSE","7/1/2013-6/30/2014","","","",1.0563,"","","","","","PO Box 2349","Fayetteville, NC 28302",""]
["@NC012000037","Housing Authority of the City Winston-Salem","A-4044","060316908","0419","2013-09-30","FALSE","FALSE","7/1/2013-6/30/2014","","","",1.0563,"","","","","","500 West Fourth Street, Suite 300","Winston-Salem, NC 27101",""]
["@NJ008000015","Long Branch Housing Authority","NY407","142302152","0239","2014-06-30","FALSE","FALSE","7/1/2013-6/30/2014","","","",1.0563,"","","","","","PO Box 337","Long Branch, NJ 07740",""]
["@NJ008000017","Long Branch Housing Authority","NY407","142302152","0239","2014-06-30","FALSE","FALSE","7/1/2013-6/30/2014","","","",1.0563,"","","","","","PO Box 337","Long Branch, NJ 07740",""]
["@NJ008000018","Long Branch Housing Authority","NY407","142302152","0239","2014-06-30","FALSE","FALSE","7/1/2013-6/30/2014","","","",1.0563,"","","","","","PO Box 337","Long Branch, NJ 07740",""]
["@NJ021000021","Paterson Housing Authority","NY-323","085664001","0239","2013-03-31","FALSE","FALSE","7/1/2013-6/30/2014","","","",1.0563,"","","","","","60 Van Houten Street","Paterson, NJ 07505",""]
["@OH003000128","Cuyahoga MHA","C-5003","077748028","0512","2014-12-31","FALSE","FALSE","7/1/2013-6/30/2014","","","",1.0563,"","","","","","1441 W 25th Street","Cleveland, OH 44113",""]
["@OH003000129","Cuyahoga MHA","C-5003","077748028","0512","2014-12-31","FALSE","FALSE","7/1/2013-6/30/2014","","","",1.0563,"","","","","","1441 W 25th Street","Cleveland, OH 44113",""]
["@OH003000131","Cuyahoga MHA","C-5003","077748028","0512","2014-12-31","FALSE","FALSE","7/1/2013-6/30/2014","","","",1.0563,"","","","","","1441 W 25th Street","Cleveland, OH 44113",""]
["@OH003000132","Cuyahoga MHA","C-5003","077748028","0512","2014-12-31","FALSE","FALSE","7/1/2013-6/30/2014","","","",1.0563,"","","","","","1441 W 25th Street","Cleveland, OH 44113",""]
["@OH003000932","Cuyahoga MHA","C-5003","077748028","0512","2014-12-31","FALSE","FALSE","7/1/2013-6/30/2014","","","",1.0563,"","","","","","1441 W 25th Street","Cleveland, OH 44113",""]
["@OH005000014","Dayton MHA","C-926","746895830","0510","2013-06-30","FALSE","FALSE","7/1/2013-6/30/2014","","","",1.0563,"","","","","","400 Wayne Ave","Dayton, OH 45401",""]
["@OH008021000","Trumbull MHA","C-5001","083323287","0512","2013-06-30","FALSE","FALSE","7/1/2013-6/30/2014","","","",1.0563,"","","","","","4076 Youngstown Road SE","Warren, OH 44484",""]
["@RI005000013","Newport HA","NY - 374","624922704","0143","2013-03-31","FALSE","FALSE","7/1/2013-6/30/2014","","","",1.0563,"","","","","","120b Hillside Avenue","Newport, RI 02840",""]
["@TN001000072","MEMPHIS HOUSING AUTHORITY","A-3768","007046725","0440","2013-06-30","FALSE","FALSE","7/1/2013-6/30/2014","","","",1.0563,"","","","","","PO Box 3664","Memphis, TN 38103",""]
["@TX006000056","San Antonio","FW-1427","025775458","0659","2013-06-30","FALSE","FALSE","7/1/2013-6/30/2014","","","",1.0563,"","","","","","PO Drawer 1300","San Antonio, TX 78295",""]
["@TX065000050","Harlingen Housing authority","FW-4014","106233083","0659","2013-03-31","FALSE","FALSE","7/1/2013-6/30/2014","","","",1.0563,"","","","","","PO Box 1669","Harlingen, TX 78551",""]
["@VA007000017","Richmond Redevelopment and Housing Authority","P-200","066005877","0336","2014-09-30","FALSE","FALSE","7/1/2013-6/30/2014","","","",1.0563,"","","","","","PO Box 26887","Richmond, VA 23261",""]
["@VA007000036","Richmond Redevelopment and Housing Authority","P-200","066005877","0336","2014-09-30","FALSE","FALSE","7/1/2013-6/30/2014",null,null,null,1.0563,null,null,null,null,null,"PO Box 26887","Richmond, VA 23261"]
["@WI021000002","Brillion Hsg Auth","C-579","830263596","0539","2014-12-31","FALSE","FALSE","7/1/2013-6/30/2014",null,null,null,1.0563,null,null,null,null,null,"210 South Parkway","Brillion, WI 54110"]
["@WI031000003","Wausau HA","C-642","088239058","0539","2014-12-31","FALSE","FALSE","7/1/2013-6/30/2014",null,null,null,1.0563,null,null,null,null,null,"550 E Thomas Street","Wausau, WI 54403"]
["@WI064000005","Beloit Hsg Auth","C-6176","073859266","0539","2014-12-31","FALSE","FALSE","7/1/2013-6/30/2014",null,null,null,1.0563,null,null,null,null,null,"100 State Street","Beloit, WI 53511"]
["@WI064000006","Beloit Hsg Auth","C-6176","073859266","0539","2014-12-31","FALSE","FALSE","7/1/2013-6/30/2014",null,null,null,1.0563,null,null,null,null,null,"100 State Street","Beloit, WI 53511"]
["@WI064000007","Beloit Hsg Auth","C-6176","073859266","0539","2014-12-31","FALSE","FALSE","7/1/2013-6/30/2014",null,null,null,1.0563,null,null,null,null,null,"100 State Street","Beloit, WI 53511"]
["@WI065000016","Appleton Hsg Auth","C-840","607253721","0539","2014-12-31","FALSE","FALSE","7/1/2013-6/30/2014",null,null,null,1.0563,null,null,null,null,null,"925 W. Northland","Appleton, WI 54914"]
["@WI065000017","Appleton Hsg Auth","C-840","607253721","0539","2014-12-31","FALSE","FALSE","7/1/2013-6/30/2014",null,null,null,1.0563,null,null,null,null,null,"925 W. Northland","Appleton, WI 54914"]
["@WI113000006","Housing Authority of the City of Oshkosh, Wi","C-6162","837115109","0539","2014-12-31","FALSE","FALSE","7/1/2013-6/30/2014",null,null,null,1.0563,null,null,null,null,null,"PO Box 397","Oshkosh, WI 54902"]
["@WI113000007","Oshkosh Housing Auth","C-6162","837115109","0539","2014-12-31","FALSE","FALSE","7/1/2013-6/30/2014",null,null,null,1.0563,null,null,null,null,null,"PO Box 397","Oshkosh, WI 54902"]

{"sheet":"UEL Details Prepop","index":8,"n_rows":589,"n_cols":23,"rows_kept":589,"cut":false,"hidden":false,"merged":[]}
["PPN","FundingYear","UtilityCategory","UtilityType","ActualConsumption","UnitOfConsumption","ActualConsumptionYear-1","ActualConsumptionYear-2","ActualConsumptionYear-3","ActualConsumptionTotal","ActualConsumptionAvg","ActualConsumptionNewUnits","RollingBaseConsumption","BaseConsumptionMinusCalculated","CalculatedLine10","CalculatedLine11","CalculatedLine12","CalculatedLine13","AnnualizedComsumptionNewUnits","CalculatedLine15","ActualUtilityCosts","CalculatedLine17","CalculatedLine18"]
["Please Select PPN",null,null,null,null,null,0]
["Please Select PPN",null,null,null,null,null,0]
["Please Select PPN",null,null,null,null,null,0]
["Please Select PPN",null,null,null,null,null,0]
["Please Select PPN",null,null,null,null,null,0]
["Please Select PPN",null,null,null,null,null,0]
["Please Select PPN",null,null,null,null,null,0]
["Please Select PPN",null,null,null,null,null,0]
["Please Select PPN",null,null,null,null,null,0]
["Please Select PPN",null,null,null,null,null,0]
["Please Select PPN",null,null,null,null,null,0]
["Please Select PPN",null,null,null,null,null,0]
["@AL005000018",2015,null,null,0,null,null,null,null,"","","","","","","","","","","","","",""]
["@AL005000018",2015,null,null,0,null,null,null,null,"","","","","","","","","","","","","",""]
["@AL005000018",2015,null,null,0,null,null,null,null,"","","","","","","","","","","","","",""]
["@AL005000018",2015,null,null,0,null,null,null,null,"","","","","","","","","","","","","",""]
["@AL005000018",2015,null,null,0,null,null,null,null,"","","","","","","","","","","","","",""]
["@AL005000018",2015,null,null,0,null,null,null,null,"","","","","","","","","","","","","",""]
["@AL005000018",2015,null,null,0,null,null,null,null,"","","","","","","","","","","","","",""]
["@AL005000018",2015,null,null,0,null,null,null,null,"","","","","","","","","","","","","",""]
["@AL005000018",2015,null,null,0,null,null,null,null,"","","","","","","","","","","","","",""]
["@AL005000018",2015,null,null,0,null,null,null,null,"","","","","","","","","","","","","",""]
["@AL005000018",2015,null,null,0,null,null,null,null,"","","","","","","","","","","","","",""]
["@AL005000018",2015,null,null,0,null,null,null,null,"","","","","","","","","","","","","",""]
["@AL190000004",2015,null,null,0]
["@AL190000004",2015,null,null,0]
["@AL190000004",2015,null,null,0]
["@AL190000004",2015,null,null,0]
["@AL190000004",2015,null,null,0]
["@AL190000004",2015,null,null,0]
["@AL190000004",2015,null,null,0]
["@AL190000004",2015,null,null,0]
["@AL190000004",2015,null,null,0]
["@AL190000004",2015,null,null,0]
["@AL190000004",2015,null,null,0]
["@AL190000004",2015,null,null,0]
["@FL003000043",2015,null,null,0,null,null,null,null,"","","","","","","","","","","","","",""]
["@FL003000043",2015,null,null,0,null,null,null,null,"","","","","","","","","","","","","",""]
["@FL003000043",2015,null,null,0,null,null,null,null,"","","","","","","","","","","","","",""]
["@FL003000043",2015,null,null,0,null,null,null,null,"","","","","","","","","","","","","",""]
["@FL003000043",2015,null,null,0,null,null,null,null,"","","","","","","","","","","","","",""]
["@FL003000043",2015,null,null,0,null,null,null,null,"","","","","","","","","","","","","",""]
["@FL003000043",2015,null,null,0,null,null,null,null,"","","","","","","","","","","","","",""]
["@FL003000043",2015,null,null,0,null,null,null,null,"","","","","","","","","","","","","",""]
["@FL003000043",2015,null,null,0,null,null,null,null,"","","","","","","","","","","","","",""]
["@FL003000043",2015,null,null,0,null,null,null,null,"","","","","","","","","","","","","",""]
["@FL003000043",2015,null,null,0,null,null,null,null,"","","","","","","","","","","","","",""]
["@FL003000043",2015,null,null,0,null,null,null,null,"","","","","","","","","","","","","",""]
["@FL005000848",2015,null,null,0,null,null,null,null,"","","","","","","","","","","","","",""]
["@FL005000848",2015,null,null,0,null,null,null,null,"","","","","","","","","","","","","",""]
["@FL005000848",2015,null,null,0,null,null,null,null,"","","","","","","","","","","","","",""]
["@FL005000848",2015,null,null,0,null,null,null,null,"","","","","","","","","","","","","",""]
["@FL005000848",2015,null,null,0,null,null,null,null,"","","","","","","","","","","","","",""]
["@FL005000848",2015,null,null,0,null,null,null,null,"","","","","","","","","","","","","",""]
["@FL005000848",2015,null,null,0,null,null,null,null,"","","","","","","","","","","","","",""]
["@FL005000848",2015,null,null,0,null,null,null,null,"","","","","","","","","","","","","",""]
["@FL005000848",2015,null,null,0,null,null,null,null,"","","","","","","","","","","","","",""]
["@FL005000848",2015,null,null,0,null,null,null,null,"","","","","","","","","","","","","",""]
["@FL005000848",2015,null,null,0,null,null,null,null,"","","","","","","","","","","","","",""]
["@FL005000848",2015,null,null,0,null,null,null,null,"","","","","","","","","","","","","",""]
["@FL005000849",2015,null,null,0,null,null,null,null,"","","","","","","","","","","","","",""]
["@FL005000849",2015,null,null,0,null,null,null,null,"","","","","","","","","","","","","",""]
["@FL005000849",2015,null,null,0,null,null,null,null,"","","","","","","","","","","","","",""]
["@FL005000849",2015,null,null,0,null,null,null,null,"","","","","","","","","","","","","",""]
["@FL005000849",2015,null,null,0,null,null,null,null,"","","","","","","","","","","","","",""]
["@FL005000849",2015,null,null,0,null,null,null,null,"","","","","","","","","","","","","",""]
["@FL005000849",2015,null,null,0,null,null,null,null,"","","","","","","","","","","","","",""]
["@FL005000849",2015,null,null,0,null,null,null,null,"","","","","","","","","","","","","",""]
["@FL005000849",2015,null,null,0,null,null,null,null,"","","","","","","","","","","","","",""]
["@FL005000849",2015,null,null,0,null,null,null,null,"","","","","","","","","","","","","",""]
["@FL005000849",2015,null,null,0,null,null,null,null,"","","","","","","","","","","","","",""]
["@FL005000849",2015,null,null,0,null,null,null,null,"","","","","","","","","","","","","",""]
["@FL005000850",2015,null,null,0,null,null,null,null,"","","","","","","","","","","","","",""]
["@FL005000850",2015,null,null,0,null,null,null,null,"","","","","","","","","","","","","",""]
["@FL005000850",2015,null,null,0,null,null,null,null,"","","","","","","","","","","","","",""]
["@FL005000850",2015,null,null,0,null,null,null,null,"","","","","","","","","","","","","",""]
["@FL005000850",2015,null,null,0,null,null,null,null,"","","","","","","","","","","","","",""]
["@FL005000850",2015,null,null,0,null,null,null,null,"","","","","","","","","","","","","",""]
["@FL005000850",2015,null,null,0,null,null,null,null,"","","","","","","","","","","","","",""]
["@FL005000850",2015,null,null,0,null,null,null,null,"","","","","","","","","","","","","",""]
["@FL005000850",2015,null,null,0,null,null,null,null,"","","","","","","","","","","","","",""]
["@FL005000850",2015,null,null,0,null,null,null,null,"","","","","","","","","","","","","",""]
["@FL005000850",2015,null,null,0,null,null,null,null,"","","","","","","","","","","","","",""]
["@FL005000850",2015,null,null,0,null,null,null,null,"","","","","","","","","","","","","",""]
["@FL005000851",2015,null,null,0,null,null,null,null,"","","","","","","","","","","","","",""]
["@FL005000851",2015,null,null,0,null,null,null,null,"","","","","","","","","","","","","",""]
["@FL005000851",2015,null,null,0,null,null,null,null,"","","","","","","","","","","","","",""]
["@FL005000851",2015,null,null,0,null,null,null,null,"","","","","","","","","","","","","",""]
["@FL005000851",2015,null,null,0,null,null,null,null,"","","","","","","","","","","","","",""]
["@FL005000851",2015,null,null,0,null,null,null,null,"","","","","","","","","","","","","",""]
["@FL005000851",2015,null,null,0,null,null,null,null,"","","","","","","","","","","","","",""]
["@FL005000851",2015,null,null,0,null,null,null,null,"","","","","","","","","","","","","",""]
["@FL005000851",2015,null,null,0,null,null,null,null,"","","","","","","","","","","","","",""]
["@FL005000851",2015,null,null,0,null,null,null,null,"","","","","","","","","","","","","",""]
["@FL005000851",2015,null,null,0,null,null,null,null,"","","","","","","","","","","","","",""]
["@FL005000851",2015,null,null,0,null,null,null,null,"","","","","","","","","","","","","",""]
["@FL005000852",2015,null,null,0,null,null,null,null,"","","","","","","","","","","","","",""]
["@FL005000852",2015,null,null,0,null,null,null,null,"","","","","","","","","","","","","",""]
["@FL005000852",2015,null,null,0,null,null,null,null,"","","","","","","","","","","","","",""]
["@FL005000852",2015,null,null,0,null,null,null,null,"","","","","","","","","","","","","",""]
["@FL005000852",2015,null,null,0,null,null,null,null,"","","","","","","","","","","","","",""]
["@FL005000852",2015,null,null,0,null,null,null,null,"","","","","","","","","","","","","",""]
["@FL005000852",2015,null,null,0,null,null,null,null,"","","","","","","","","","","","","",""]
["@FL005000852",2015,null,null,0,null,null,null,null,"","","","","","","","","","","","","",""]
["@FL005000852",2015,null,null,0,null,null,null,null,"","","","","","","","","","","","","",""]
["@FL005000852",2015,null,null,0,null,null,null,null,"","","","","","","","","","","","","",""]
["@FL005000852",2015,null,null,0,null,null,null,null,"","","","","","","","","","","","","",""]
["@FL005000852",2015,null,null,0,null,null,null,null,"","","","","","","","","","","","","",""]
["@FL021000004",2015,null,null,0,null,null,null,null,"","","","","","","","","","","","","",""]
["@FL021000004",2015,null,null,0,null,null,null,null,"","","","","","","","","","","","","",""]
["@FL021000004",2015,null,null,0,null,null,null,null,"","","","","","","","","","","","","",""]
["@FL021000004",2015,null,null,0,null,null,null,null,"","","","","","","","","","","","","",""]
["@FL021000004",2015,null,null,0,null,null,null,null,"","","","","","","","","","","","","",""]
["@FL021000004",2015,null,null,0,null,null,null,null,"","","","","","","","","","","","","",""]
["@FL021000004",2015,null,null,0,null,null,null,null,"","","","","","","","","","","","","",""]
["@FL021000004",2015,null,null,0,null,null,null,null,"","","","","","","","","","","","","",""]
["@FL021000004",2015,null,null,0,null,null,null,null,"","","","","","","","","","","","","",""]
["@FL021000004",2015,null,null,0,null,null,null,null,"","","","","","","","","","","","","",""]
["@FL021000004",2015,null,null,0,null,null,null,null,"","","","","","","","","","","","","",""]
["@FL021000004",2015,null,null,0,null,null,null,null,"","","","","","","","","","","","","",""]
["@FL062000011",2015,null,null,0,null,null,null,null,"","","","","","","","","","","","","",""]
["@FL062000011",2015,null,null,0,null,null,null,null,"","","","","","","","","","","","","",""]
["@FL062000011",2015,null,null,0,null,null,null,null,"","","","","","","","","","","","","",""]
["@FL062000011",2015,null,null,0,null,null,null,null,"","","","","","","","","","","","","",""]
["@FL062000011",2015,null,null,0,null,null,null,null,"","","","","","","","","","","","","",""]
["@FL062000011",2015,null,null,0,null,null,null,null,"","","","","","","","","","","","","",""]
["@FL062000011",2015,null,null,0,null,null,null,null,"","","","","","","","","","","","","",""]
["@FL062000011",2015,null,null,0,null,null,null,null,"","","","","","","","","","","","","",""]
["@FL062000011",2015,null,null,0,null,null,null,null,"","","","","","","","","","","","","",""]
["@FL062000011",2015,null,null,0,null,null,null,null,"","","","","","","","","","","","","",""]
["@FL062000011",2015,null,null,0,null,null,null,null,"","","","","","","","","","","","","",""]
["@FL062000011",2015,null,null,0,null,null,null,null,"","","","","","","","","","","","","",""]
["@IN003000008",2015,null,null,0]
["@IN003000008",2015,null,null,0]
["@IN003000008",2015,null,null,0]
["@IN003000008",2015,null,null,0]
["@IN003000008",2015,null,null,0]
["@IN003000008",2015,null,null,0]
["@IN003000008",2015,null,null,0]
["@IN003000008",2015,null,null,0]
["@IN003000008",2015,null,null,0]
["@IN003000008",2015,null,null,0]
["@IN003000008",2015,null,null,0]
["@IN003000008",2015,null,null,0]
["@LA004000006",2015,null,null,0]
["@LA004000006",2015,null,null,0]
["@LA004000006",2015,null,null,0]
["@LA004000006",2015,null,null,0]
["@LA004000006",2015,null,null,0]
["@LA004000006",2015,null,null,0]
["@LA004000006",2015,null,null,0]
["@LA004000006",2015,null,null,0]
["@LA004000006",2015,null,null,0]
["@LA004000006",2015,null,null,0]
["@LA004000006",2015,null,null,0]
["@LA004000006",2015,null,null,0]
["@MI001000081",2015,null,null,0]
["@MI001000081",2015,null,null,0]
["@MI001000081",2015,null,null,0]
["@MI001000081",2015,null,null,0]
["@MI001000081",2015,null,null,0]
["@MI001000081",2015,null,null,0]
["@MI001000081",2015,null,null,0]
["@MI001000081",2015,null,null,0]
["@MI001000081",2015,null,null,0]
["@MI001000081",2015,null,null,0]
["@MI001000081",2015,null,null,0]
["@MI001000081",2015,null,null,0]
["@MN003000014",2015,null,null,0,null,null,null,null,"","","","","","","","","","","","","",""]
["@MN003000014",2015,null,null,0,null,null,null,null,"","","","","","","","","","","","","",""]
["@MN003000014",2015,null,null,0,null,null,null,null,"","","","","","","","","","","","","",""]
["@MN003000014",2015,null,null,0,null,null,null,null,"","","","","","","","","","","","","",""]
["@MN003000014",2015,null,null,0,null,null,null,null,"","","","","","","","","","","","","",""]
["@MN003000014",2015,null,null,0,null,null,null,null,"","","","","","","","","","","","","",""]
["@MN003000014",2015,null,null,0,null,null,null,null,"","","","","","","","","","","","","",""]
["@MN003000014",2015,null,null,0,null,null,null,null,"","","","","","","","","","","","","",""]
["@MN003000014",2015,null,null,0,null,null,null,null,"","","","","","","","","","","","","",""]
["@MN003000014",2015,null,null,0,null,null,null,null,"","","","","","","","","","","","","",""]
["@MN003000014",2015,null,null,0,null,null,null,null,"","","","","","","","","","","","","",""]
["@MN003000014",2015,null,null,0,null,null,null,null,"","","","","","","","","","","","","",""]
["@MO009000002",2015,null,null,0]
["@MO009000002",2015,null,null,0]
["@MO009000002",2015,null,null,0]
["@MO009000002",2015,null,null,0]
["@MO009000002",2015,null,null,0]
["@MO009000002",2015,null,null,0]
["@MO009000002",2015,null,null,0]
["@MO009000002",2015,null,null,0]
["@MO009000002",2015,null,null,0]
["@MO009000002",2015,null,null,0]
["@MO009000002",2015,null,null,0]
["@MO009000002",2015,null,null,0]
["@MS004000021",2015,null,null,0,null,null,null,null,"","","","","","","","","","","","","",""]
["@MS004000021",2015,null,null,0,null,null,null,null,"","","","","","","","","","","","","",""]
["@MS004000021",2015,null,null,0,null,null,null,null,"","","","","","","","","","","","","",""]
["@MS004000021",2015,null,null,0,null,null,null,null,"","","","","","","","","","","","","",""]
["@MS004000021",2015,null,null,0,null,null,null,null,"","","","","","","","","","","","","",""]
["@MS004000021",2015,null,null,0,null,null,null,null,"","","","","","","","","","","","","",""]
["@MS004000021",2015,null,null,0,null,null,null,null,"","","","","","","","","","","","","",""]
["@MS004000021",2015,null,null,0,null,null,null,null,"","","","","","","","","","","","","",""]
["@MS004000021",2015,null,null,0,null,null,null,null,"","","","","","","","","","","","","",""]
["@MS004000021",2015,null,null,0,null,null,null,null,"","","","","","","","","","","","","",""]
["@MS004000021",2015,null,null,0,null,null,null,null,"","","","","","","","","","","","","",""]
["@MS004000021",2015,null,null,0,null,null,null,null,"","","","","","","","","","","","","",""]
["@MS103000003",2015,null,null,0,null,null,null,null,"","","","","","","","","","","","","",""]
["@MS103000003",2015,null,null,0,null,null,null,null,"","","","","","","","","","","","","",""]
["@MS103000003",2015,null,null,0,null,null,null,null,"","","","","","","","","","","","","",""]
["@MS103000003",2015,null,null,0,null,null,null,null,"","","","","","","","","","","","","",""]
["@MS103000003",2015,null,null,0,null,null,null,null,"","","","","","","","","","","","","",""]
["@MS103000003",2015,null,null,0,null,null,null,null,"","","","","","","","","","","","","",""]
["@MS103000003",2015,null,null,0,null,null,null,null,"","","","","","","","","","","","","",""]
["@MS103000003",2015,null,null,0,null,null,null,null,"","","","","","","","","","","","","",""]
["@MS103000003",2015,null,null,0,null,null,null,null,"","","","","","","","","","","","","",""]
["@MS103000003",2015,null,null,0,null,null,null,null,"","","","","","","","","","","","","",""]
["@MS103000003",2015,null,null,0,null,null,null,null,"","","","","","","","","","","","","",""]
["@MS103000003",2015,null,null,0,null,null,null,null,"","","","","","","","","","","","","",""]
["@NC003000063",2015,null,null,0,null,null,null,null,"","","","","","","","","","","","","",""]
["@NC003000063",2015,null,null,0,null,null,null,null,"","","","","","","","","","","","","",""]
["@NC003000063",2015,null,null,0,null,null,null,null,"","","","","","","","","","","","","",""]
["@NC003000063",2015,null,null,0,null,null,null,null,"","","","","","","","","","","","","",""]
["@NC003000063",2015,null,null,0,null,null,null,null,"","","","","","","","","","","","","",""]
["@NC003000063",2015,null,null,0,null,null,null,null,"","","","","","","","","","","","","",""]
["@NC003000063",2015,null,null,0,null,null,null,null,"","","","","","","","","","","","","",""]
["@NC003000063",2015,null,null,0,null,null,null,null,"","","","","","","","","","","","","",""]
["@NC003000063",2015,null,null,0,null,null,null,null,"","","","","","","","","","","","","",""]
["@NC003000063",2015,null,null,0,null,null,null,null,"","","","","","","","","","","","","",""]
["@NC003000063",2015,null,null,0,null,null,null,null,"","","","","","","","","","","","","",""]
["@NC003000063",2015,null,null,0,null,null,null,null,"","","","","","","","","","","","","",""]
["@NC003000064",2015,null,null,0,null,null,null,null,"","","","","","","","","","","","","",""]
["@NC003000064",2015,null,null,0,null,null,null,null,"","","","","","","","","","","","","",""]
["@NC003000064",2015,null,null,0,null,null,null,null,"","","","","","","","","","","","","",""]
["@NC003000064",2015,null,null,0,null,null,null,null,"","","","","","","","","","","","","",""]
["@NC003000064",2015,null,null,0,null,null,null,null,"","","","","","","","","","","","","",""]
["@NC003000064",2015,null,null,0,null,null,null,null,"","","","","","","","","","","","","",""]
["@NC003000064",2015,null,null,0,null,null,null,null,"","","","","","","","","","","","","",""]
["@NC003000064",2015,null,null,0,null,null,null,null,"","","","","","","","","","","","","",""]
["@NC003000064",2015,null,null,0,null,null,null,null,"","","","","","","","","","","","","",""]
["@NC003000064",2015,null,null,0,null,null,null,null,"","","","","","","","","","","","","",""]
["@NC003000064",2015,null,null,0,null,null,null,null,"","","","","","","","","","","","","",""]
["@NC003000064",2015,null,null,0,null,null,null,null,"","","","","","","","","","","","","",""]
["@NC003000065",2015,null,null,0,null,null,null,null,"","","","","","","","","","","","","",""]
["@NC003000065",2015,null,null,0,null,null,null,null,"","","","","","","","","","","","","",""]
["@NC003000065",2015,null,null,0,null,null,null,null,"","","","","","","","","","","","","",""]
["@NC003000065",2015,null,null,0,null,null,null,null,"","","","","","","","","","","","","",""]
["@NC003000065",2015,null,null,0,null,null,null,null,"","","","","","","","","","","","","",""]
["@NC003000065",2015,null,null,0,null,null,null,null,"","","","","","","","","","","","","",""]
["@NC003000065",2015,null,null,0,null,null,null,null,"","","","","","","","","","","","","",""]
["@NC003000065",2015,null,null,0,null,null,null,null,"","","","","","","","","","","","","",""]
["@NC003000065",2015,null,null,0,null,null,null,null,"","","","","","","","","","","","","",""]
["@NC003000065",2015,null,null,0,null,null,null,null,"","","","","","","","","","","","","",""]
["@NC003000065",2015,null,null,0,null,null,null,null,"","","","","","","","","","","","","",""]
["@NC003000065",2015,null,null,0,null,null,null,null,"","","","","","","","","","","","","",""]
["@NC009000024",2015,null,null,0,null,null,null,null,"","","","","","","","","","","","","",""]
["@NC009000024",2015,null,null,0,null,null,null,null,"","","","","","","","","","","","","",""]
["@NC009000024",2015,null,null,0,null,null,null,null,"","","","","","","","","","","","","",""]
["@NC009000024",2015,null,null,0,null,null,null,null,"","","","","","","","","","","","","",""]
["@NC009000024",2015,null,null,0,null,null,null,null,"","","","","","","","","","","","","",""]
["@NC009000024",2015,null,null,0,null,null,null,null,"","","","","","","","","","","","","",""]
["@NC009000024",2015,null,null,0,null,null,null,null,"","","","","","","","","","","","","",""]
["@NC009000024",2015,null,null,0,null,null,null,null,"","","","","","","","","","","","","",""]
["@NC009000024",2015,null,null,0,null,null,null,null,"","","","","","","","","","","","","",""]
["@NC009000024",2015,null,null,0,null,null,null,null,"","","","","","","","","","","","","",""]
["@NC009000024",2015,null,null,0,null,null,null,null,"","","","","","","","","","","","","",""]
["@NC009000024",2015,null,null,0,null,null,null,null,"","","","","","","","","","","","","",""]
["@NC012000037",2015,null,null,0,null,null,null,null,"","","","","","","","","","","","","",""]
["@NC012000037",2015,null,null,0,null,null,null,null,"","","","","","","","","","","","","",""]
["@NC012000037",2015,null,null,0,null,null,null,null,"","","","","","","","","","","","","",""]
["@NC012000037",2015,null,null,0,null,null,null,null,"","","","","","","","","","","","","",""]
["@NC012000037",2015,null,null,0,null,null,null,null,"","","","","","","","","","","","","",""]
["@NC012000037",2015,null,null,0,null,null,null,null,"","","","","","","","","","","","","",""]
["@NC012000037",2015,null,null,0,null,null,null,null,"","","","","","","","","","","","","",""]
["@NC012000037",2015,null,null,0,null,null,null,null,"","","","","","","","","","","","","",""]
["@NC012000037",2015,null,null,0,null,null,null,null,"","","","","","","","","","","","","",""]
["@NC012000037",2015,null,null,0,null,null,null,null,"","","","","","","","","","","","","",""]
["@NC012000037",2015,null,null,0,null,null,null,null,"","","","","","","","","","","","","",""]
["@NC012000037",2015,null,null,0,null,null,null,null,"","","","","","","","","","","","","",""]
["@NJ008000015",2015,null,null,0,null,null,null,null,"","","","","","","","","","","","","",""]
["@NJ008000015",2015,null,null,0,null,null,null,null,"","","","","","","","","","","","","",""]
["@NJ008000015",2015,null,null,0,null,null,null,null,"","","","","","","","","","","","","",""]
["@NJ008000015",2015,null,null,0,null,null,null,null,"","","","","","","","","","","","","",""]
["@NJ008000015",2015,null,null,0,null,null,null,null,"","","","","","","","","","","","","",""]
["@NJ008000015",2015,null,null,0,null,null,null,null,"","","","","","","","","","","","","",""]
["@NJ008000015",2015,null,null,0,null,null,null,null,"","","","","","","","","","","","","",""]
["@NJ008000015",2015,null,null,0,null,null,null,null,"","","","","","","","","","","","","",""]
["@NJ008000015",2015,null,null,0,null,null,null,null,"","","","","","","","","","","","","",""]
["@NJ008000015",2015,null,null,0,null,null,null,null,"","","","","","","","","","","","","",""]
["@NJ008000015",2015,null,null,0,null,null,null,null,"","","","","","","","","","","","","",""]
["@NJ008000015",2015,null,null,0,null,null,null,null,"","","","","","","","","","","","","",""]
["@NJ008000017",2015,null,null,0,null,null,null,null,"","","","","","","","","","","","","",""]
["@NJ008000017",2015,null,null,0,null,null,null,null,"","","","","","","","","","","","","",""]
["@NJ008000017",2015,null,null,0,null,null,null,null,"","","","","","","","","","","","","",""]
["@NJ008000017",2015,null,null,0,null,null,null,null,"","","","","","","","","","","","","",""]
["@NJ008000017",2015,null,null,0,null,null,null,null,"","","","","","","","","","","","","",""]
["@NJ008000017",2015,null,null,0,null,null,null,null,"","","","","","","","","","","","","",""]
["@NJ008000017",2015,null,null,0,null,null,null,null,"","","","","","","","","","","","","",""]
["@NJ008000017",2015,null,null,0,null,null,null,null,"","","","","","","","","","","","","",""]
["@NJ008000017",2015,null,null,0,null,null,null,null,"","","","","","","","","","","","","",""]
["@NJ008000017",2015,null,null,0,null,null,null,null,"","","","","","","","","","","","","",""]
["@NJ008000017",2015,null,null,0,null,null,null,null,"","","","","","","","","","","","","",""]
["@NJ008000017",2015,null,null,0,null,null,null,null,"","","","","","","","","","","","","",""]
["@NJ008000018",2015,null,null,0,null,null,null,null,"","","","","","","","","","","","","",""]
["@NJ008000018",2015,null,null,0,null,null,null,null,"","","","","","","","","","","","","",""]
["@NJ008000018",2015,null,null,0,null,null,null,null,"","","","","","","","","","","","","",""]
["@NJ008000018",2015,null,null,0,null,null,null,null,"","","","","","","","","","","","","",""]
["@NJ008000018",2015,null,null,0,null,null,null,null,"","","","","","","","","","","","","",""]
["@NJ008000018",2015,null,null,0,null,null,null,null,"","","","","","","","","","","","","",""]
["@NJ008000018",2015,null,null,0,null,null,null,null,"","","","","","","","","","","","","",""]
["@NJ008000018",2015,null,null,0,null,null,null,null,"","","","","","","","","","","","","",""]
["@NJ008000018",2015,null,null,0,null,null,null,null,"","","","","","","","","","","","","",""]
["@NJ008000018",2015,null,null,0,null,null,null,null,"","","","","","","","","","","","","",""]
["@NJ008000018",2015,null,null,0,null,null,null,null,"","","","","","","","","","","","","",""]
["@NJ008000018",2015,null,null,0,null,null,null,null,"","","","","","","","","","","","","",""]
["@NJ021000021",2015,null,null,0]
["@NJ021000021",2015,null,null,0]
["@NJ021000021",2015,null,null,0]
["@NJ021000021",2015,null,null,0]
["@NJ021000021",2015,null,null,0]
["@NJ021000021",2015,null,null,0]
["@NJ021000021",2015,null,null,0]
["@NJ021000021",2015,null,null,0]
["@NJ021000021",2015,null,null,0]
["@NJ021000021",2015,null,null,0]
["@NJ021000021",2015,null,null,0]
["@NJ021000021",2015,null,null,0]
["@OH003000128",2015,null,null,0,null,null,null,null,"","","","","","","","","","","","","",""]
["@OH003000128",2015,null,null,0,null,null,null,null,"","","","","","","","","","","","","",""]
["@OH003000128",2015,null,null,0,null,null,null,null,"","","","","","","","","","","","","",""]
["@OH003000128",2015,null,null,0,null,null,null,null,"","","","","","","","","","","","","",""]
["@OH003000128",2015,null,null,0,null,null,null,null,"","","","","","","","","","","","","",""]
["@OH003000128",2015,null,null,0,null,null,null,null,"","","","","","","","","","","","","",""]
["@OH003000128",2015,null,null,0,null,null,null,null,"","","","","","","","","","","","","",""]
["@OH003000128",2015,null,null,0,null,null,null,null,"","","","","","","","","","","","","",""]
["@OH003000128",2015,null,null,0,null,null,null,null,"","","","","","","","","","","","","",""]
["@OH003000128",2015,null,null,0,null,null,null,null,"","","","","","","","","","","","","",""]
["@OH003000128",2015,null,null,0,null,null,null,null,"","","","","","","","","","","","","",""]
["@OH003000128",2015,null,null,0,null,null,null,null,"","","","","","","","","","","","","",""]
["@OH003000129",2015,null,null,0,null,null,null,null,"","","","","","","","","","","","","",""]
["@OH003000129",2015,null,null,0,null,null,null,null,"","","","","","","","","","","","","",""]
["@OH003000129",2015,null,null,0,null,null,null,null,"","","","","","","","","","","","","",""]
["@OH003000129",2015,null,null,0,null,null,null,null,"","","","","","","","","","","","","",""]
["@OH003000129",2015,null,null,0,null,null,null,null,"","","","","","","","","","","","","",""]
["@OH003000129",2015,null,null,0,null,null,null,null,"","","","","","","","","","","","","",""]
["@OH003000129",2015,null,null,0,null,null,null,null,"","","","","","","","","","","","","",""]
["@OH003000129",2015,null,null,0,null,null,null,null,"","","","","","","","","","","","","",""]
["@OH003000129",2015,null,null,0,null,null,null,null,"","","","","","","","","","","","","",""]
["@OH003000129",2015,null,null,0,null,null,null,null,"","","","","","","","","","","","","",""]
["@OH003000129",2015,null,null,0,null,null,null,null,"","","","","","","","","","","","","",""]
["@OH003000129",2015,null,null,0,null,null,null,null,"","","","","","","","","","","","","",""]
["@OH003000131",2015,null,null,0,null,null,null,null,"","","","","","","","","","","","","",""]
["@OH003000131",2015,null,null,0,null,null,null,null,"","","","","","","","","","","","","",""]
["@OH003000131",2015,null,null,0,null,null,null,null,"","","","","","","","","","","","","",""]
["@OH003000131",2015,null,null,0,null,null,null,null,"","","","","","","","","","","","","",""]
["@OH003000131",2015,null,null,0,null,null,null,null,"","","","","","","","","","","","","",""]
["@OH003000131",2015,null,null,0,null,null,null,null,"","","","","","","","","","","","","",""]
["@OH003000131",2015,null,null,0,null,null,null,null,"","","","","","","","","","","","","",""]
["@OH003000131",2015,null,null,0,null,null,null,null,"","","","","","","","","","","","","",""]
["@OH003000131",2015,null,null,0,null,null,null,null,"","","","","","","","","","","","","",""]
["@OH003000131",2015,null,null,0,null,null,null,null,"","","","","","","","","","","","","",""]
["@OH003000131",2015,null,null,0,null,null,null,null,"","","","","","","","","","","","","",""]
["@OH003000131",2015,null,null,0,null,null,null,null,"","","","","","","","","","","","","",""]
["@OH003000132",2015,null,null,0]
["@OH003000132",2015,null,null,0]
["@OH003000132",2015,null,null,0]
["@OH003000132",2015,null,null,0]
["@OH003000132",2015,null,null,0]
["@OH003000132",2015,null,null,0]
["@OH003000132",2015,null,null,0]
["@OH003000132",2015,null,null,0]
["@OH003000132",2015,null,null,0]
["@OH003000132",2015,null,null,0]
["@OH003000132",2015,null,null,0]
["@OH003000132",2015,null,null,0]
["@OH003000932",2015,null,null,0,null,null,null,null,"","","","","","","","","","","","","",""]
["@OH003000932",2015,null,null,0,null,null,null,null,"","","","","","","","","","","","","",""]
["@OH003000932",2015,null,null,0,null,null,null,null,"","","","","","","","","","","","","",""]
["@OH003000932",2015,null,null,0,null,null,null,null,"","","","","","","","","","","","","",""]
["@OH003000932",2015,null,null,0,null,null,null,null,"","","","","","","","","","","","","",""]
["@OH003000932",2015,null,null,0,null,null,null,null,"","","","","","","","","","","","","",""]
["@OH003000932",2015,null,null,0,null,null,null,null,"","","","","","","","","","","","","",""]
["@OH003000932",2015,null,null,0,null,null,null,null,"","","","","","","","","","","","","",""]
["@OH003000932",2015,null,null,0,null,null,null,null,"","","","","","","","","","","","","",""]
["@OH003000932",2015,null,null,0,null,null,null,null,"","","","","","","","","","","","","",""]
["@OH003000932",2015,null,null,0,null,null,null,null,"","","","","","","","","","","","","",""]
["@OH003000932",2015,null,null,0,null,null,null,null,"","","","","","","","","","","","","",""]
["@OH005000014",2015,null,null,0,null,null,null,null,"","","","","","","","","","","","","",""]
["@OH005000014",2015,null,null,0,null,null,null,null,"","","","","","","","","","","","","",""]
["@OH005000014",2015,null,null,0,null,null,null,null,"","","","","","","","","","","","","",""]
["@OH005000014",2015,null,null,0,null,null,null,null,"","","","","","","","","","","","","",""]
["@OH005000014",2015,null,null,0,null,null,null,null,"","","","","","","","","","","","","",""]
["@OH005000014",2015,null,null,0,null,null,null,null,"","","","","","","","","","","","","",""]
["@OH005000014",2015,null,null,0,null,null,null,null,"","","","","","","","","","","","","",""]
["@OH005000014",2015,null,null,0,null,null,null,null,"","","","","","","","","","","","","",""]
["@OH005000014",2015,null,null,0,null,null,null,null,"","","","","","","","","","","","","",""]
["@OH005000014",2015,null,null,0,null,null,null,null,"","","","","","","","","","","","","",""]
["@OH005000014",2015,null,null,0,null,null,null,null,"","","","","","","","","","","","","",""]
["@OH005000014",2015,null,null,0,null,null,null,null,"","","","","","","","","","","","","",""]
["@OH008021000",2015,null,null,0,null,null,null,null,"","","","","","","","","","","","","",""]
["@OH008021000",2015,null,null,0,null,null,null,null,"","","","","","","","","","","","","",""]
["@OH008021000",2015,null,null,0,null,null,null,null,"","","","","","","","","","","","","",""]
["@OH008021000",2015,null,null,0,null,null,null,null,"","","","","","","","","","","","","",""]
["@OH008021000",2015,null,null,0,null,null,null,null,"","","","","","","","","","","","","",""]
["@OH008021000",2015,null,null,0,null,null,null,null,"","","","","","","","","","","","","",""]
["@OH008021000",2015,null,null,0,null,null,null,null,"","","","","","","","","","","","","",""]
["@OH008021000",2015,null,null,0,null,null,null,null,"","","","","","","","","","","","","",""]
["@OH008021000",2015,null,null,0,null,null,null,null,"","","","","","","","","","","","","",""]
["@OH008021000",2015,null,null,0,null,null,null,null,"","","","","","","","","","","","","",""]
["@OH008021000",2015,null,null,0,null,null,null,null,"","","","","","","","","","","","","",""]
["@OH008021000",2015,null,null,0,null,null,null,null,"","","","","","","","","","","","","",""]
["@RI005000013",2015,null,null,0,null,null,null,null,"","","","","","","","","","","","","",""]
["@RI005000013",2015,null,null,0,null,null,null,null,"","","","","","","","","","","","","",""]
["@RI005000013",2015,null,null,0,null,null,null,null,"","","","","","","","","","","","","",""]
["@RI005000013",2015,null,null,0,null,null,null,null,"","","","","","","","","","","","","",""]
["@RI005000013",2015,null,null,0,null,null,null,null,"","","","","","","","","","","","","",""]
["@RI005000013",2015,null,null,0,null,null,null,null,"","","","","","","","","","","","","",""]
["@RI005000013",2015,null,null,0,null,null,null,null,"","","","","","","","","","","","","",""]
["@RI005000013",2015,null,null,0,null,null,null,null,"","","","","","","","","","","","","",""]
["@RI005000013",2015,null,null,0,null,null,null,null,"","","","","","","","","","","","","",""]
["@RI005000013",2015,null,null,0,null,null,null,null,"","","","","","","","","","","","","",""]
["@RI005000013",2015,null,null,0,null,null,null,null,"","","","","","","","","","","","","",""]
["@RI005000013",2015,null,null,0,null,null,null,null,"","","","","","","","","","","","","",""]
["@TN001000072",2015,null,null,0,null,null,null,null,"","","","","","","","","","","","","",""]
["@TN001000072",2015,null,null,0,null,null,null,null,"","","","","","","","","","","","","",""]
["@TN001000072",2015,null,null,0,null,null,null,null,"","","","","","","","","","","","","",""]
["@TN001000072",2015,null,null,0,null,null,null,null,"","","","","","","","","","","","","",""]
["@TN001000072",2015,null,null,0,null,null,null,null,"","","","","","","","","","","","","",""]
["@TN001000072",2015,null,null,0,null,null,null,null,"","","","","","","","","","","","","",""]
["@TN001000072",2015,null,null,0,null,null,null,null,"","","","","","","","","","","","","",""]
["@TN001000072",2015,null,null,0,null,null,null,null,"","","","","","","","","","","","","",""]
["@TN001000072",2015,null,null,0,null,null,null,null,"","","","","","","","","","","","","",""]
["@TN001000072",2015,null,null,0,null,null,null,null,"","","","","","","","","","","","","",""]
["@TN001000072",2015,null,null,0,null,null,null,null,"","","","","","","","","","","","","",""]
["@TN001000072",2015,null,null,0,null,null,null,null,"","","","","","","","","","","","","",""]
["@TX006000056",2015,null,null,0,null,null,null,null,"","","","","","","","","","","","","",""]
["@TX006000056",2015,null,null,0,null,null,null,null,"","","","","","","","","","","","","",""]
["@TX006000056",2015,null,null,0,null,null,null,null,"","","","","","","","","","","","","",""]
["@TX006000056",2015,null,null,0,null,null,null,null,"","","","","","","","","","","","","",""]
["@TX006000056",2015,null,null,0,null,null,null,null,"","","","","","","","","","","","","",""]
["@TX006000056",2015,null,null,0,null,null,null,null,"","","","","","","","","","","","","",""]
["@TX006000056",2015,null,null,0,null,null,null,null,"","","","","","","","","","","","","",""]
["@TX006000056",2015,null,null,0,null,null,null,null,"","","","","","","","","","","","","",""]
["@TX006000056",2015,null,null,0,null,null,null,null,"","","","","","","","","","","","","",""]
["@TX006000056",2015,null,null,0,null,null,null,null,"","","","","","","","","","","","","",""]
["@TX006000056",2015,null,null,0,null,null,null,null,"","","","","","","","","","","","","",""]
["@TX006000056",2015,null,null,0,null,null,null,null,"","","","","","","","","","","","","",""]
["@TX006000056",2015,null,null,0,null,null,null,null,"","","","","","","","","","","","","",""]
["@TX006000056",2015,null,null,0,null,null,null,null,"","","","","","","","","","","","","",""]
["@TX006000056",2015,null,null,0,null,null,null,null,"","","","","","","","","","","","","",""]
["@TX006000056",2015,null,null,0,null,null,null,null,"","","","","","","","","","","","","",""]
["@TX006000056",2015,null,null,0,null,null,null,null,"","","","","","","","","","","","","",""]
["@TX006000056",2015,null,null,0,null,null,null,null,"","","","","","","","","","","","","",""]
["@TX006000056",2015,null,null,0,null,null,null,null,"","","","","","","","","","","","","",""]
["@TX006000056",2015,null,null,0,null,null,null,null,"","","","","","","","","","","","","",""]
["@TX006000056",2015,null,null,0,null,null,null,null,"","","","","","","","","","","","","",""]
["@TX006000056",2015,null,null,0,null,null,null,null,"","","","","","","","","","","","","",""]
["@TX006000056",2015,null,null,0,null,null,null,null,"","","","","","","","","","","","","",""]
["@TX006000056",2015,null,null,0,null,null,null,null,"","","","","","","","","","","","","",""]
["@TX065000050",2015,null,null,0]
["@TX065000050",2015,null,null,0]
["@TX065000050",2015,null,null,0]
["@TX065000050",2015,null,null,0]
["@TX065000050",2015,null,null,0]
["@TX065000050",2015,null,null,0]
["@TX065000050",2015,null,null,0]
["@TX065000050",2015,null,null,0]
["@TX065000050",2015,null,null,0]
["@TX065000050",2015,null,null,0]
["@TX065000050",2015,null,null,0]
["@TX065000050",2015,null,null,0]
["@VA007000017",2015,null,null,0,null,null,null,null,"","","","","","","","","","","","","",""]
["@VA007000017",2015,null,null,0,null,null,null,null,"","","","","","","","","","","","","",""]
["@VA007000017",2015,null,null,0,null,null,null,null,"","","","","","","","","","","","","",""]
["@VA007000017",2015,null,null,0,null,null,null,null,"","","","","","","","","","","","","",""]
["@VA007000017",2015,null,null,0,null,null,null,null,"","","","","","","","","","","","","",""]
["@VA007000017",2015,null,null,0,null,null,null,null,"","","","","","","","","","","","","",""]
["@VA007000017",2015,null,null,0,null,null,null,null,"","","","","","","","","","","","","",""]
["@VA007000017",2015,null,null,0,null,null,null,null,"","","","","","","","","","","","","",""]
["@VA007000017",2015,null,null,0,null,null,null,null,"","","","","","","","","","","","","",""]
["@VA007000017",2015,null,null,0,null,null,null,null,"","","","","","","","","","","","","",""]
["@VA007000017",2015,null,null,0,null,null,null,null,"","","","","","","","","","","","","",""]
["@VA007000017",2015,null,null,0,null,null,null,null,"","","","","","","","","","","","","",""]
["@VA007000036",2015,null,null,0,null,null,null,null,"","","","","","","","","","","","","",""]
["@VA007000036",2015,null,null,0,null,null,null,null,"","","","","","","","","","","","","",""]
["@VA007000036",2015,null,null,0,null,null,null,null,"","","","","","","","","","","","","",""]
["@VA007000036",2015,null,null,0,null,null,null,null,"","","","","","","","","","","","","",""]
["@VA007000036",2015,null,null,0,null,null,null,null,"","","","","","","","","","","","","",""]
["@VA007000036",2015,null,null,0,null,null,null,null,"","","","","","","","","","","","","",""]
["@VA007000036",2015,null,null,0,null,null,null,null,"","","","","","","","","","","","","",""]
["@VA007000036",2015,null,null,0,null,null,null,null,"","","","","","","","","","","","","",""]
["@VA007000036",2015,null,null,0,null,null,null,null,"","","","","","","","","","","","","",""]
["@VA007000036",2015,null,null,0,null,null,null,null,"","","","","","","","","","","","","",""]
["@VA007000036",2015,null,null,0,null,null,null,null,"","","","","","","","","","","","","",""]
["@VA007000036",2015,null,null,0,null,null,null,null,"","","","","","","","","","","","","",""]
["@WI021000002",2015,null,null,0,null,null,null,null,"","","","","","","","","","","","","",""]
["@WI021000002",2015,null,null,0,null,null,null,null,"","","","","","","","","","","","","",""]
["@WI021000002",2015,null,null,0,null,null,null,null,"","","","","","","","","","","","","",""]
["@WI021000002",2015,null,null,0,null,null,null,null,"","","","","","","","","","","","","",""]
["@WI021000002",2015,null,null,0,null,null,null,null,"","","","","","","","","","","","","",""]
["@WI021000002",2015,null,null,0,null,null,null,null,"","","","","","","","","","","","","",""]
["@WI021000002",2015,null,null,0,null,null,null,null,"","","","","","","","","","","","","",""]
["@WI021000002",2015,null,null,0,null,null,null,null,"","","","","","","","","","","","","",""]
["@WI021000002",2015,null,null,0,null,null,null,null,"","","","","","","","","","","","","",""]
["@WI021000002",2015,null,null,0,null,null,null,null,"","","","","","","","","","","","","",""]
["@WI021000002",2015,null,null,0,null,null,null,null,"","","","","","","","","","","","","",""]
["@WI021000002",2015,null,null,0,null,null,null,null,"","","","","","","","","","","","","",""]
["@WI031000003",2015,null,null,0,null,null,null,null,"","","","","","","","","","","","","",""]
["@WI031000003",2015,null,null,0,null,null,null,null,"","","","","","","","","","","","","",""]
["@WI031000003",2015,null,null,0,null,null,null,null,"","","","","","","","","","","","","",""]
["@WI031000003",2015,null,null,0,null,null,null,null,"","","","","","","","","","","","","",""]
["@WI031000003",2015,null,null,0,null,null,null,null,"","","","","","","","","","","","","",""]
["@WI031000003",2015,null,null,0,null,null,null,null,"","","","","","","","","","","","","",""]
["@WI031000003",2015,null,null,0,null,null,null,null,"","","","","","","","","","","","","",""]
["@WI031000003",2015,null,null,0,null,null,null,null,"","","","","","","","","","","","","",""]
["@WI031000003",2015,null,null,0,null,null,null,null,"","","","","","","","","","","","","",""]
["@WI031000003",2015,null,null,0,null,null,null,null,"","","","","","","","","","","","","",""]
["@WI031000003",2015,null,null,0,null,null,null,null,"","","","","","","","","","","","","",""]
["@WI031000003",2015,null,null,0,null,null,null,null,"","","","","","","","","","","","","",""]
["@WI064000005",2015,null,null,0,null,null,null,null,"","","","","","","","","","","","","",""]
["@WI064000005",2015,null,null,0,null,null,null,null,"","","","","","","","","","","","","",""]
["@WI064000005",2015,null,null,0,null,null,null,null,"","","","","","","","","","","","","",""]
["@WI064000005",2015,null,null,0,null,null,null,null,"","","","","","","","","","","","","",""]
["@WI064000005",2015,null,null,0,null,null,null,null,"","","","","","","","","","","","","",""]
["@WI064000005",2015,null,null,0,null,null,null,null,"","","","","","","","","","","","","",""]
["@WI064000005",2015,null,null,0,null,null,null,null,"","","","","","","","","","","","","",""]
["@WI064000005",2015,null,null,0,null,null,null,null,"","","","","","","","","","","","","",""]
["@WI064000005",2015,null,null,0,null,null,null,null,"","","","","","","","","","","","","",""]
["@WI064000005",2015,null,null,0,null,null,null,null,"","","","","","","","","","","","","",""]
["@WI064000005",2015,null,null,0,null,null,null,null,"","","","","","","","","","","","","",""]
["@WI064000005",2015,null,null,0,null,null,null,null,"","","","","","","","","","","","","",""]
["@WI064000006",2015,null,null,0,null,null,null,null,"","","","","","","","","","","","","",""]
["@WI064000006",2015,null,null,0,null,null,null,null,"","","","","","","","","","","","","",""]
["@WI064000006",2015,null,null,0,null,null,null,null,"","","","","","","","","","","","","",""]
["@WI064000006",2015,null,null,0,null,null,null,null,"","","","","","","","","","","","","",""]
["@WI064000006",2015,null,null,0,null,null,null,null,"","","","","","","","","","","","","",""]
["@WI064000006",2015,null,null,0,null,null,null,null,"","","","","","","","","","","","","",""]
["@WI064000006",2015,null,null,0,null,null,null,null,"","","","","","","","","","","","","",""]
["@WI064000006",2015,null,null,0,null,null,null,null,"","","","","","","","","","","","","",""]
["@WI064000006",2015,null,null,0,null,null,null,null,"","","","","","","","","","","","","",""]
["@WI064000006",2015,null,null,0,null,null,null,null,"","","","","","","","","","","","","",""]
["@WI064000006",2015,null,null,0,null,null,null,null,"","","","","","","","","","","","","",""]
["@WI064000006",2015,null,null,0,null,null,null,null,"","","","","","","","","","","","","",""]
["@WI064000007",2015,null,null,0,null,null,null,null,"","","","","","","","","","","","","",""]
["@WI064000007",2015,null,null,0,null,null,null,null,"","","","","","","","","","","","","",""]
["@WI064000007",2015,null,null,0,null,null,null,null,"","","","","","","","","","","","","",""]
["@WI064000007",2015,null,null,0,null,null,null,null,"","","","","","","","","","","","","",""]
["@WI064000007",2015,null,null,0,null,null,null,null,"","","","","","","","","","","","","",""]
["@WI064000007",2015,null,null,0,null,null,null,null,"","","","","","","","","","","","","",""]
["@WI064000007",2015,null,null,0,null,null,null,null,"","","","","","","","","","","","","",""]
["@WI064000007",2015,null,null,0,null,null,null,null,"","","","","","","","","","","","","",""]
["@WI064000007",2015,null,null,0,null,null,null,null,"","","","","","","","","","","","","",""]
["@WI064000007",2015,null,null,0,null,null,null,null,"","","","","","","","","","","","","",""]
["@WI064000007",2015,null,null,0,null,null,null,null,"","","","","","","","","","","","","",""]
["@WI064000007",2015,null,null,0,null,null,null,null,"","","","","","","","","","","","","",""]
["@WI065000016",2015,null,null,0,null,null,null,null,"","","","","","","","","","","","","",""]
["@WI065000016",2015,null,null,0,null,null,null,null,"","","","","","","","","","","","","",""]
["@WI065000016",2015,null,null,0,null,null,null,null,"","","","","","","","","","","","","",""]
["@WI065000016",2015,null,null,0,null,null,null,null,"","","","","","","","","","","","","",""]
["@WI065000016",2015,null,null,0,null,null,null,null,"","","","","","","","","","","","","",""]
["@WI065000016",2015,null,null,0,null,null,null,null,"","","","","","","","","","","","","",""]
["@WI065000016",2015,null,null,0,null,null,null,null,"","","","","","","","","","","","","",""]
["@WI065000016",2015,null,null,0,null,null,null,null,"","","","","","","","","","","","","",""]
["@WI065000016",2015,null,null,0,null,null,null,null,"","","","","","","","","","","","","",""]
["@WI065000016",2015,null,null,0,null,null,null,null,"","","","","","","","","","","","","",""]
["@WI065000016",2015,null,null,0,null,null,null,null,"","","","","","","","","","","","","",""]
["@WI065000016",2015,null,null,0,null,null,null,null,"","","","","","","","","","","","","",""]
["@WI113000006",2015,null,null,0]
["@WI113000006",2015,null,null,0]
["@WI113000006",2015,null,null,0]
["@WI113000006",2015,null,null,0]
["@WI113000006",2015,null,null,0]
["@WI113000006",2015,null,null,0]
["@WI113000006",2015,null,null,0]
["@WI113000006",2015,null,null,0]
["@WI113000006",2015,null,null,0]
["@WI113000006",2015,null,null,0]
["@WI113000006",2015,null,null,0]
["@WI113000006",2015,null,null,0]
["@WI113000007",2015,null,null,0,null,null,null,null,"","","","","","","","","","","","","",""]
["@WI113000007",2015,null,null,0,null,null,null,null,"","","","","","","","","","","","","",""]
["@WI113000007",2015,null,null,0,null,null,null,null,"","","","","","","","","","","","","",""]
["@WI113000007",2015,null,null,0,null,null,null,null,"","","","","","","","","","","","","",""]
["@WI113000007",2015,null,null,0,null,null,null,null,"","","","","","","","","","","","","",""]
["@WI113000007",2015,null,null,0,null,null,null,null,"","","","","","","","","","","","","",""]
["@WI113000007",2015,null,null,0,null,null,null,null,"","","","","","","","","","","","","",""]
["@WI113000007",2015,null,null,0,null,null,null,null,"","","","","","","","","","","","","",""]
["@WI113000007",2015,null,null,0,null,null,null,null,"","","","","","","","","","","","","",""]
["@WI113000007",2015,null,null,0,null,null,null,null,"","","","","","","","","","","","","",""]
["@WI113000007",2015,null,null,0,null,null,null,null,"","","","","","","","","","","","","",""]
["@WI113000007",2015,null,null,0,null,null,null,null,"","","","","","","","","","","","","",""]